{"text_format":"1","workbook":"xlsx","n_sheets":4,"sheets":["Pdiss & Compensation","Control Loop1","Control Loop2","Diode Curve"],"not_rendered":{"charts":11,"images":1,"macros":1,"external_links":0,"defined_names":166,"comments":1,"pivot_tables":0},"unopened":[],"bounds":{"document_bytes":16777216,"sheet_cells":100000,"rows_first":2000,"rows_last":500,"rows_between":2000,"halvings":0,"cell_chars":16384,"cell_head_chars":4096},"cells_cut":0,"cells_raw":0,"read":"whole","date_system":"1900"}

{"sheet":"Pdiss & Compensation","index":0,"n_rows":182,"n_cols":66,"rows_kept":182,"cut":false,"hidden":false,"merged":[[112,1,112,3],[133,3,134,3],[33,1,34,1],[33,3,34,3],[36,1,36,3],[46,1,46,3],[58,1,58,3],[78,1,78,3],[94,3,95,3],[59,1,60,1],[71,1,71,3],[102,1,102,3]]}
["A4411 Estimated Power Dissipation and Compensation Worksheet",null,null,null,null,null,"Reset =",0,null,null,null,null,null,null,null,null,null,null,null,null,null,null,null,null,null,null,null,null,null,null,null,null,null,null,null,null,null,null,0]
[null,"= Design Entry",null,"If any cells give an error try clicking on \"Converge\"",null,null,"Buck","Vin",{"$f":"Vin_nom","v":12},{"$f":"Vin_min","v":3.5},{"$f":"J2+(Vin_max-Vin_min)/49","v":3.795918367346939},4.091836734693878,4.387755102040817,4.683673469387756,4.979591836734695,5.275510204081634,5.571428571428573,5.8673469387755119,6.1632653061224509,6.4591836734693899,6.7551020408163289,7.0510204081632679,7.3469387755102069,7.6428571428571459,7.9387755102040849,8.2346938775510239,8.5306122448979629,8.8265306122449019,9.1224489795918409,9.4183673469387799,9.7142857142857189,10.010204081632658,10.306122448979597,10.602040816326536,10.897959183673475,11.193877551020414,11.489795918367353,11.785714285714292,12.081632653061231,12.37755102040817,12.673469387755109,12.969387755102048,{"$f":"AP2+(Vin_max-Vin_min)/49","v":13.265306122448987},13.561224489795926,13.857142857142865,14.153061224489804,14.448979591836743,14.744897959183682,15.040816326530621,15.33673469387756,15.632653061224499,15.928571428571438,16.224489795918377,16.520408163265316,16.816326530612255,17.112244897959194,17.408163265306133,17.704081632653072,18.000000000000011,{"$f":"V_AbsMax","v":36},"Vin"]
[null,"** Ensure iterative calculations are enabled **",null,null,null,null,"Buck-Boost","Pdiss total",{"$f":"I33+I36+I59+I62+I65+I68+I21*Icc+I52+I56","v":0.61834704090896708},0.96585947644189885,0.85435054749799211,0.77313561774267447,0.71255059830469158,0.66659324477493764,0.63135744031050667,0.60420197594582503,0.58328380525858747,0.56728250516152179,0.55523071345473995,0.54640534441546862,0.54023699459020802,0.52787476143439038,0.5212415846341929,0.52417445525453266,0.52763714882904644,0.53160149314937255,0.53604309439753639,0.54094072775215374,0.54627584158358322,0.55203215142612738,0.55819530541918538,0.5647526070314558,0.57169278399506851,0.57900579474554636,0.58668266547997505,0.59471535234854367,0.60309662438529787,0.61181996363749791,0.62087947962508594,0.63026983579414897,{"$f":"AO33+AO36+AO59+AO62+AO65+AO68+AO21*Icc+AO52+AO56","v":0.63998618605235835},0.65002411981402097,0.66037961425581104,0.6710489927054718,0.6820288882655986,0.69331621192144144,0.70490812450209539,0.71680201196360571,0.72899546354452782,0.74148625241253008,0.75427231847734233,0.76735175309275439,0.78072278541014251,0.79438377017948769,0.80833317682210981,0.8225695796232908,0.8370916489133019,0.85189814312267997,0.86698790161240036,1.3774504392496325,"Pdiss total","Buck-Boost"]
[null,"Select Topology:","Buck-Boost","Select either Buck or Buck-Boost operation",null,null,null,"Tj",{"$f":"IF(Reset=1,150,Ta+Rth_ja*I3)","v":143.55041122726902},{"$f":"IF(Reset=1,150,Ta+Rth_ja*J3)","v":153.97578429325696},{"$f":"IF(Reset=1,150,Ta+Rth_ja*K3)","v":150.63051642493977},148.19406853228023,146.37651794914075,144.99779734324812,143.94072320931519,143.12605927837475,142.49851415775763,142.01847515484565,141.6569214036422,141.39216033246407,141.20710983770624,140.8362428430317,140.63724753902579,140.72523365763598,140.8291144648714,140.94804479448118,141.08129283192608,141.2282218325646,141.38827524750749,141.56096454278384,141.74585916257556,141.94257821094368,142.15078351985204,142.3701738423664,142.60047996439926,142.84146057045632,143.09289873155893,143.35459890912495,143.62638438875257,143.90809507382448,144.19958558157074,{"$f":"IF(Reset=1,150,Ta+Rth_ja*AP3)","v":144.50072359442063},144.81138842767433,145.13146978116416,145.46086664796795,145.79948635764325,146.14724373506286,146.50406035890816,146.86986390633584,147.24458757237591,147.62816955432027,148.02055259278262,148.42168356230428,148.83151310538463,149.24999530466329,149.67708738869874,150.11274946739906,150.5569442936804,151.00963704837201,{"$f":"IF(Reset=1,150,Ta+Rth_ja*BH3)","v":166.32351317748896},"Tj"]
[null,null,null,null,null,null,"Yes",null,null,{"$f":"J2","v":3.5},{"$f":"K2","v":3.795918367346939},4.091836734693878,4.387755102040817,4.683673469387756,4.979591836734695,5.275510204081634,5.571428571428573,5.8673469387755119,6.1632653061224509,6.4591836734693899,6.7551020408163289,7.0510204081632679,7.3469387755102069,7.6428571428571459,7.9387755102040849,8.2346938775510239,8.5306122448979629,8.8265306122449019,9.1224489795918409,9.4183673469387799,9.7142857142857189,10.010204081632658,10.306122448979597,10.602040816326536,10.897959183673475,11.193877551020414,11.489795918367353,11.785714285714292,12.081632653061231,12.37755102040817,12.673469387755109,12.969387755102048,13.265306122448987,13.561224489795926,13.857142857142865,14.153061224489804,14.448979591836743,14.744897959183682,15.040816326530621,15.33673469387756,15.632653061224499,15.928571428571438,16.224489795918377,16.520408163265316,16.816326530612255,17.112244897959194,17.408163265306133,17.704081632653072,18.000000000000011,36]
[null,"Vin nom",12,"Enter nominal operating voltage here",null,null,"No"]
[null,"Vin min (Buck Boost)",3.5,"Enter minimum voltage for Buck Boost mode"]
[null,"Vin min (Buck)",6,"Enter minimum voltage for Buck mode",null,null,"Buck Boost Mode Calculations",null,{"$f":"IF(I14>I12,\"Boost >\",\"buck >\")","v":"buck >"},"buck >","buck >","buck >","buck >","buck >","buck >","buck >","buck >","buck >","buck >","buck >","buck >","buck >","buck >","buck >","buck >","buck >","buck >","buck >","buck >","buck >","buck >","buck >","buck >","buck >","buck >","buck >","buck >","buck >","buck >","buck >",{"$f":"IF(AO14>AO12,\"Boost >\",\"buck >\")","v":"buck >"},"buck >","buck >","buck >","buck >","buck >","buck >","buck >","buck >","buck >","buck >","buck >","buck >","buck >","buck >","buck >","buck >","buck >","buck >","buck >",null,"Buck Boost Mode Calculations"]
[null,"Vin max (operating)",18,"Enter maximum operating voltage. This is used for plots.",null,null,null,"V1",{"$f":"IF(Reset=1,I2-Vreg,IF(I14=0,I2-(I22-I23/2)*(I30+dcr*10^-3)-I21-I75,I2-(I22-I23/2)*(I30+R_ds_ON_boost+dcr*10^-3)))","v":6.1125726860453584},{"$f":"IF(Reset=1,J2,IF(J14=0,J2-(J22-J23/2)*(J30+dcr*10^-3)-J21-J75,J2-(J22-J23/2)*(J30+R_ds_ON_boost+dcr*10^-3)))","v":3.0197006927099883},3.3595523020914277,3.6920220762905078,4.0188226220540608,4.3411368657284255,4.6598141999421925,4.975483308911743,5.2886211147212805,5.5995968843881458,5.9087015179491846,6.2161675313661897,6.5221813831476396,6.8388846449430361,1.4629010246091969,1.7583815669683056,2.0539216383137848,2.3495107629966419,2.6451403972995302,2.9408035301343212,3.2364943753458815,3.5322081325733437,3.8279407999107913,4.1236890260549703,4.4194499928053137,4.7152213210769442,5.0110009952619112,5.3067873020069323,5.602578780391922,5.8983741811794719,6.1941724333232999,6.4899726163173446,6.7857739372686181,{"$f":"IF(Reset=1,AP2,IF(AP14=0,AP2-(AP22-AP23/2)*(AP30+dcr*10^-3)-AP21-AP75,AP2-(AP22-AP23/2)*(AP30+R_ds_ON_boost+dcr*10^-3)))","v":7.0815757118092337},7.3773773481432432,7.6731783336644428,7.9689782236916198,8.2647766319547227,8.5605732225343925,8.8563677030123102,9.1521598186337485,9.4479493473191933,9.743736095390382,10.03951989389936,10.335300595467974,10.631078071560667,10.926852210126087,11.222622913553389,11.518390096897775,11.814153686336903,12.10991361782569,30.102204488086151,"V1"]
[null,"Vin abs max",36,"Enter abs maximum voltage.",null,null,null,"V2",{"$f":"IF(Reset=1,0,IF(I12>I14,IF(I14=0,0,Vreg+I71+(I22-I23/2)*(I30+dcr*10^-3)-I2),I71+(I22-I23/2)*(R_ds_ON_boost+dcr*10^-3)))","v":0},{"$f":"IF(Reset=1,J71,IF(J12>J14,IF(J14=0,0,Vreg+J71+(J22-J23/2)*(J30+dcr*10^-3)-J2),J71+(J22-J23/2)*(R_ds_ON_boost+dcr*10^-3)))","v":2.7477863116274666},2.3964021466473575,2.0545940434204262,1.7200546047913736,1.3912165201361688,1.0669696729092379,0.74650124692213637,0.42919994816489382,0.11459575366594432,-0.1976795314436357,-0.50795424778860809,-0.81759011320497521,-1.137515343505366,0,0,0,0,0,0,0,0,0,0,0,0,0,0,0,0,0,0,0,{"$f":"IF(Reset=1,AP71,IF(AP12>AP14,IF(AP14=0,0,Vreg+AP71+(AP22-AP23/2)*(AP30+dcr*10^-3)-AP2),AP71+(AP22-AP23/2)*(R_ds_ON_boost+dcr*10^-3)))","v":0},0,0,0,0,0,0,0,0,0,0,0,0,0,0,0,0,0,0,"V2"]
[null,"Switching frequency",2000,"Enter nominal switching frequency",null,null,"ton min (LG)","V3",{"$f":"IF(Reset=1,Vreg,Vreg+I71+I75+(I22-I23/2)*dcr*10^-3)","v":6.0895258121686782},{"$f":"Vreg+J71+J75+(J22-J23/2)*dcr*10^-3","v":6.3287468910160598},6.2954831444560391,6.267321595902299,6.2433262860039243,6.2226286039748597,6.204601346084595,6.1887778298498661,6.1748022910368343,6.1623980138457304,6.1513460728050351,6.1414353967217519,6.1313971708249646,6.121529261175878,6.0999564889637234,6.0990780072660495,6.098233215711609,6.0974216705208084,6.0966425738112653,6.0958948990184787,6.0951774796229214,6.0944890718505942,6.0938283988031134,6.0931941812745807,6.0925851589909481,6.0920001049448622,6.0914378347500744,6.0908972124076017,6.0903771534953703,6.0898766265190387,6.089394652963251,6.0889303064380575,6.0884827112094957,{"$f":"Vreg+AP71+AP75+(AP22-AP23/2)*dcr*10^-3","v":6.0880510403257508},6.087634513493013,6.0872323948129887,6.0868439904626488,6.0864686463737021,6.0861057459520431,6.085754707864762,6.0854149839128855,6.0850860570011278,6.0847674392108582,6.0844586699788525,6.0841593143817425,6.0838689615242378,6.0835872230279273,6.0833137316166148,6.0830481397936289,6.0827901186062681,6.0825393564923989,6.0773159037241706,"V3"]
[null,"FSET Resistor (RFSET) = ",{"$f":"(fsw/12724)^-1.175","v":8.794730912029582},"Required frequency setting resistor (KΩ), use the closest available 1% value",null,null,55,"Buck duty",{"$f":"IF(Reset=1,0.7,IF(I14=0,IF(I11/(I9+I11)>1,1,I11/(I9+I11)),IF(IF((I11*(1-I14)+I10*I14)/(I9+I10)>I14,(I10*I14-I11+I9*I14)/(I10-I11),(I11*(1-I14)+I10*I14)/(I9+I10))>$M$169,$M$169,IF((I11*(1-I14)+I10*I14)/(I9+I10)>I14,(I10*I14-I11+I9*I14)/(I10-I11),(I11*(1-I14)+I10*I14)/(I9+I10)))))","v":0.49905561842989327},0.83318549935273278,0.81372507198916832,0.79879008324012279,0.78706490202260326,0.77768706681197453,0.77007305238123347,0.76381443927230763,0.75861731294270085,0.75426517564080131,0.75059535149300183,0.74747926572775047,0.74468562628695389,0.74103246366121434,0.80656768662059874,0.77621500303555235,0.74805169000198846,0.72185041356862567,0.6974140851996673,0.67457102246024325,0.65317100454806964,0.63308203659401263,0.61418767930955465,0.59638483259780706,0.57958188600138649,0.56369716736592845,0.54865763531916689,0.53439777217069895,0.52085864241093061,0.50798708870924647,0.49573504261327217,0.48405893135744787,{"$f":"IF(Reset=1,0.7,IF(AO14=0,IF(AO11/(AO9+AO11)>1,1,AO11/(AO9+AO11)),IF(IF((AO11*(1-AO14)+AO10*AO14)/(AO9+AO10)>AO14,(AO10*AO14-AO11+AO9*AO14)/(AO10-AO11),(AO11*(1-AO14)+AO10*AO14)/(AO9+AO10))>$M$169,$M$169,IF((AO11*(1-AO14)+AO10*AO14)/(AO9+AO10)>AO14,(AO10*AO14-AO11+AO9*AO14)/(AO10-AO11),(AO11*(1-AO14)+AO10*AO14)/(AO9+AO10)))))","v":0.47291916554492686},0.46227969515831502,0.45210762352445855,0.44237287061608893,0.43304787850355514,0.42410735293924473,0.41552803601736699,0.40728850564325825,0.39936899820146177,0.39175125135610239,0.3844183643709278,0.37735467371617437,0.37054564204830959,0.36397775891733719,0.35763845178336645,0.35151600611657363,0.34559949351826819,0.33987870694024247,0.33434410219880711,0.16797668509447256,"Buck duty"]
[null,"TAMB",125,"Enter maximum ambient operating temperature",null,null,"Min Boost Duty",null,{"$f":"IF(m_*I2+b_<0,0,m_*I2+b_)","v":0},0.57999999999999996,0.54251700680272097,0.50503401360544209,0.4675510204081631,0.43006802721088422,0.39258503401360523,0.35510204081632635,0.31761904761904736,0.28013605442176848,0.24265306122448949,0.20517006802721061,0.16768707482993161,0.13020408163265274,9.2721088435373744E-2,5.5238095238094864E-2,1.7755102040815984E-2,0,0,0,0,0,0,0,0,0,0,0,0,0,0,0,{"$f":"IF(m_*AO2+b_<0,0,m_*AO2+b_)","v":0},0,0,0,0,0,0,0,0,0,0,0,0,0,0,0,0,0,0,0]
[null,null,null,null,null,null,{"$f":"t_on_min_Boost*I19*10^-6","v":0.11},"Boost duty",{"$f":"IF(I13<D_boost_min,0,I13)","v":0},0.57999999999999996,0.54251700680272097,0.50503401360544209,0.4675510204081631,0.43006802721088422,0.39258503401360523,0.35510204081632635,0.31761904761904736,0.28013605442176848,0.24265306122448949,0.20517006802721061,0.16768707482993161,0.13020408163265274,0,0,0,0,0,0,0,0,0,0,0,0,0,0,0,0,0,0,{"$f":"IF(AO13<D_boost_min,0,AO13)","v":0},0,0,0,0,0,0,0,0,0,0,0,0,0,0,0,0,0,0,{"$f":"IF(BH13<D_boost_min,0,BH13)","v":0},"Boost duty"]
[null,"VREG",5.35,"VREG is fixed at 5.35V",null,null,null,"ton buck",{"$f":"IF(I12>1,1000/fsw,IF(I12*1000/fsw<0.16,0.16,I12*1000/fsw))","v":0.24952780921494663},{"$f":"IF(J12>1,1000/fsw,IF(J12*1000/fsw<0.16,0.16,J12*1000/fsw))","v":0.41659274967636639},0.40686253599458416,0.3993950416200614,0.39353245101130163,0.38884353340598726,0.38503652619061673,0.38190721963615382,0.37930865647135042,0.37713258782040066,0.37529767574650086,0.37373963286387524,0.37234281314347695,0.37051623183060717,0.40328384331029937,0.38810750151777618,0.37402584500099423,0.36092520678431284,0.34870704259983365,0.33728551123012163,0.32658550227403482,0.31654101829700632,0.30709383965477732,0.29819241629890353,0.28979094300069325,0.28184858368296423,0.27432881765958345,0.26719888608534947,0.2604293212054653,0.25399354435462324,0.24786752130663608,0.24202946567872394,{"$f":"IF(AO12>1,1000/fsw,IF(AO12*1000/fsw<0.16,0.16,AO12*1000/fsw))","v":0.23645958277246343},0.23113984757915751,0.22605381176222925,0.22118643530804444,0.21652393925177757,0.21205367646962237,0.20776401800868347,0.20364425282162912,0.19968449910073088,0.1958756256780512,0.1922091821854639,0.18867733685808719,0.18527282102415479,0.1819888794586686,0.17881922589168323,0.17575800305828682,0.17279974675913409,0.16993935347012123,0.16717205109940356,{"$f":"IF(BH12>1,1000/fsw,IF(BH12*1000/fsw<0.16,0.16,BH12*1000/fsw))","v":0.16},"ton buck"]
[null,"Vout sync buck",3.3,"Enter sync buck output voltage, minimum is 0.800V",null,null,null,"toff buck",{"$f":"I15/I12-I15","v":0.25047219078505334},{"$f":"J15/J12-J15","v":8.3407250323633608E-2},9.3137464005415838E-2,0.1006049583799386,0.10646754898869837,0.11115646659401274,0.11496347380938327,0.11809278036384618,0.12069134352864958,0.12286741217959934,0.12470232425349909,0.12626036713612476,0.12765718685652305,0.12948376816939283,9.6716156689700628E-2,0.11189249848222382,0.12597415499900577,0.13907479321568716,0.15129295740016635,0.16271448876987837,0.17341449772596518,0.18345898170299368,0.19290616034522268,0.20180758370109647,0.21020905699930675,0.21815141631703577,0.22567118234041655,0.23280111391465053,0.2395706787945347,0.24600645564537676,0.25213247869336392,0.25797053432127603,0.26354041722753657,0.26886015242084249,0.27394618823777073,0.27881356469195551,0.2834760607482224,0.28794632353037763,0.29223598199131651,0.29635574717837088,0.30031550089926912,0.30412437432194883,0.3077908178145361,0.31132266314191281,0.31472717897584523,0.3180111205413314,0.3211807741083168,0.32424199694171318,0.32720025324086588,0.33006064652987877,0.33282794890059642,0.7925131413922929,"toff buck"]
[null,"I out ext",0,"Enter VREG external load current",null,null,null,"ton boost",{"$f":"I14/(fsw*10^-3)","v":0},{"$f":"J14/(fsw*10^-3)","v":0.28999999999999998},{"$f":"K14/(fsw*10^-3)","v":0.27125850340136048},0.25251700680272104,0.23377551020408155,0.21503401360544211,0.19629251700680261,0.17755102040816317,0.15880952380952368,0.14006802721088424,0.12132653061224474,0.1025850340136053,8.3843537414965807E-2,6.5102040816326368E-2,0,0,0,0,0,0,0,0,0,0,0,0,0,0,0,0,{"$f":"AM14/(fsw*10^-3)","v":0},0,0,0,0,0,0,0,0,0,0,0,0,0,0,0,0,0,0,0,0,{"$f":"BH14/(fsw*10^-3)","v":0},"ton boost"]
[null,"Iout Sync Buck",0.7,"Enter synchronous buck load current",null,null,null,"toff boost",{"$f":"1/fsw*10^3-I17","v":0.5},{"$f":"1/fsw*10^3-J17","v":0.21000000000000002},0.22874149659863952,0.24748299319727896,0.26622448979591845,0.28496598639455789,0.30370748299319739,0.32244897959183683,0.34119047619047632,0.35993197278911576,0.37867346938775526,0.3974149659863947,0.41615646258503419,0.43489795918367363,0.5,0.5,0.5,0.5,0.5,0.5,0.5,0.5,0.5,0.5,0.5,0.5,0.5,0.5,0.5,0.5,{"$f":"1/fsw*10^3-AM17","v":0.5},0.5,0.5,0.5,0.5,0.5,0.5,0.5,0.5,0.5,0.5,0.5,0.5,0.5,0.5,0.5,0.5,0.5,0.5,0.5,0.5,{"$f":"1/fsw*10^3-BH17","v":0.5},"toff boost"]
[null,"Iout 3V3",0,null,null,null,null,"fsw",{"$f":"1/(I15+I16)*10^3","v":2000},{"$f":"1/(J15+J16)*10^3","v":2000},2000,2000,2000,2000,2000,2000,2000,2000,2000,2000,2000,2000,2000,2000,2000,2000,2000,2000,2000,2000,2000,2000,2000,2000,2000,2000,2000,2000,{"$f":"1/(AM15+AM16)*10^3","v":2000},2000,2000,2000,2000,2000,2000,2000,2000,2000,2000,2000,2000,2000,2000,2000,2000,2000,2000,2000,2000,{"$f":"1/(BH15+BH16)*10^3","v":1049.8542818404535},"fsw"]
[null,"Iout V5A",0,null,null,null,null,"V out buck",null,null,null,null,null,null,null,null,null,null,null,null,null,null,null,null,null,null,null,null,null,null,null,null,null,null,null,null,null,null,null,null,null,null,null,null,null,null,null,null,null,null,null,null,null,null,null,null,null,null,null,null,"V out buck",null,null,"buck",null,0.54]
[null,"RFB1 =",{"$f":"(Vout_sync_buck-VFB_adj)/VFB_adj*RFB2_adj","v":4.75},"Calculated value of the ADJ feedback resistor (in KΩ) from VOUT,ADJ to VFB2",null,null,null,"VREG",{"$f":"IF(I14>0,IF(I12/(1-I14)*I9>Vreg,Vreg,I12/(1-I14)*I9),IF(I12*(I9+I11)>Vreg,Vreg,I12*(I9+I11)))","v":5.35},5.35,5.35,5.35,5.35,5.35,5.35,5.35,5.35,5.35,5.35,5.35,5.35,5.35,5.35,5.35,5.35,5.35,5.35,5.35,5.35,5.35,5.35,5.35,5.35,5.35,5.35,5.35,5.35,5.35,5.35,5.35,{"$f":"IF(AO14>0,IF(AO12/(1-AO14)*AO9>Vreg,Vreg,AO12/(1-AO14)*AO9),IF(AO12*(AO9+AO11)>Vreg,Vreg,AO12*(AO9+AO11)))","v":5.35},5.35,5.35,5.35,5.35,5.35,5.35,5.35,5.35,5.35,5.35,5.35,5.35,5.35,5.35,5.35,5.35,5.35,5.35,5.35,"VREG",null,null,"Boost duty",0.54,0]
[null,"RFB2 =",1.52,"Enter the value of the ADJ feedback resistor (in KΩ) from VFB2 to ground",null,null,"Circuit Currents","Ilpk",{"$f":"IF(I14=0,Iout_PreReg+I23/2,IF(I$12>I$14,(Iout_PreReg+I23/2*(1-I12))/(1-I14),Iout_PreReg/(1-I14)+I23/2))","v":0.99291557486450011},2.0147495423065558,1.8551795788844998,1.7185228172260774,1.6000339450848877,1.496198889326172,1.4043574423678096,1.3224583279864699,1.2488941496132671,1.1823873436830823,1.1219096237313966,1.0666243217167866,1.0158523709729561,0.96910094590668883,0.89341637024438858,0.90325432014694285,0.9123797137283427,0.92086672241349077,0.92877964020361159,0.93617446327648746,0.94310017807337276,0.94959981828000151,0.9557113373325602,0.9614683327079665,0.96690065039039785,0.97203489189441838,0.97689484159909323,0.98150182856366064,0.98587503420083966,0.99003175499126106,0.99398762769191729,0.99775682311777847,{"$f":"IF(AO14=0,Iout_PreReg+AO23/2,IF(AO$12>AO$14,(Iout_PreReg+AO23/2*(1-AO12))/(1-AO14),Iout_PreReg/(1-AO14)+AO23/2))","v":1.0013522134792634},1.0047855173785245,1.0080674258581264,1.0112077123208978,1.0142153286718749,1.0170984896506918,1.0198647470086777,1.0225210549259394,1.0250738278493614,1.0275289917543577,1.0298920296847076,1.0321680223005316,1.034361684060134,1.0364773955735351,1.0385192325912613,1.0404909920289998,1.0423962153752271,1.0442382097833005,1.0460200671105107,1.3430321543408581,"Ilpk","Circuit Currents",null,"Ipk",1.734,0.9]
[null,"Iout V5SNR",0.05,"Enter V5SNR typical load current",null,null,null,"ΔIL",{"$f":"IF(I$12>I$14,IF(I14=0,I9*I12/(L_buck*10^-6*I19*10^3),(I9*(I14)/(L_buck*10^-6*I19*10^3))),I9*(I12)/(L_buck*10^-6*I19*10^3))","v":0.32452273851404684},0.18632195763529713,0.19389513394976937,0.19836135399030774,0.19989410827455167,0.19861533698896436,0.19461418257248789,0.18795790181299235,0.17869859592295292,0.16687755080265135,0.15252813948852739,0.1356778207743552,0.11634952315428351,9.4728797296431744E-2,0.12552432927382379,0.14520022907893218,0.16345101624173186,0.180425033612028,0.19625086919226981,0.21104051533802146,0.22489194493179215,0.23789122534504961,0.25011426345016691,0.26162825420097952,0.27249288956584233,0.28276137257388345,0.29248127198323315,0.3016952459123679,0.31044165718672595,0.31875509876756863,0.32666684416888103,0.33420523502060356,{"$f":"IF(AO$12>AO$14,IF(AO14=0,AO9*AO12/(L_buck*10^-6*AO19*10^3),(AO9*(AO14)/(L_buck*10^-6*AO19*10^3))),AO9*(AO12)/(L_buck*10^-6*AO19*10^3))","v":0.34139601574357314},0.34826262354209575,0.3548264405012993,0.36110701342684226,0.36712224612879629,0.37288856808643017,0.37842108280240194,0.38373369863692547,0.38883924448376933,0.39374957229376223,0.39847564815446179,0.40302763338611003,0.40741495690531454,0.41164637993211683,0.41573005396756912,0.41967357284304596,0.42348401953550074,0.42716800835164737,0.43073172300606788,1.0247558974667628,"ΔIL",null,null,"DI",0.17799999999999999,0.252]
[null,"Iout V5CAN",0.2,"Enter V5CAN typical load current",null,null,null,"IL RMS",{"$f":"IF(I12>I14,SQRT((I22-I23/2)^2+I23^2/12+(I12-I14)*I23^2/12),SQRT((I22-I23/2)^2+I23^2/12+(I14-I12)*I23^2/12))","v":0.83853592477639305},1.9225316797397451,1.7593642121094195,1.6206514461519272,1.5015506663816509,1.3984760139793759,1.3087124512642578,1.2301661877582419,1.1611971848300455,1.1005039447501201,1.0470425620503625,0.99996912989161879,0.95860597594647556,0.92238974009801633,0.83208081725718652,0.83253053205474115,0.83299351091693996,0.8334610888701276,0.83392704530902251,0.834386956678008,0.83483772514236831,0.83527723312217916,0.83570408857238887,0.83611743618543766,0.83651681681882162,0.83690206242907017,0.8372732173029106,0.83763047887026454,0.83797415316987856,0.83830462132711547,0.83862231433978307,0.83892769415267476,{"$f":"IF(AO12>AO14,SQRT((AO22-AO23/2)^2+AO23^2/12+(AO12-AO14)*AO23^2/12),SQRT((AO22-AO23/2)^2+AO23^2/12+(AO14-AO12)*AO23^2/12))","v":0.83922123950545324},0.83950343541152583,0.8397747654032236,0.8400357058862864,0.84028672210282962,0.84052826531986291,0.8407607709498659,0.84098465737798123,0.84120032532240241,0.84140815759438692,0.84160851915497459,0.84180175738910512,0.84198820253608608,0.84216816822947704,0.8423419521104194,0.84250983648693623,0.84267208901833868,0.84282896340900293,0.84298070009977788,0.89005421269599194,"IL RMS",null,null,"IC rms",{"$f":"SQRT(((BM22-BM23/2-Iout_PreReg)^2+BM23^2/12)*(1-BM21)+Iout_PreReg^2*BM21)","v":0.8239298440160826},{"$f":"SQRT(((BN22-BN23/2-Iout_PreReg)^2+BN23^2/12)*(1-BN21)+Iout_PreReg^2*BN21)","v":9.2204658304308268E-2}]
[null,"Iout V5P",7.4999999999999997E-2,"Enter V5P typical load current",null,null,null,"Isw buck RMS",{"$f":"IF(I12>I14,SQRT(I12*(I22-I23/2)^2+I14*I23^2/12),SQRT(I12*(I22-I23/2)^2+I12*I23^2/12))","v":0.5868062663248691},1.7544849849910389,1.5865790026795104,1.4478599450629444,1.3314120532167493,1.2324441184713959,1.1475264549983262,1.0741344568787032,1.0103661572214988,0.95476021763630226,0.90617456976967836,0.86370095963328197,0.82654395640276379,0.79352205995615188,0.74600317823949092,0.73183181318125079,0.71843266876605971,0.70573860239125608,0.69369030585525093,0.68223517763357289,0.67132638565952252,0.66092208407470254,0.65098475518174659,0.64148065380118779,0.63237933585276684,0.62365325657745985,0.61527742663393159,0.60722911652394163,0.59948760156198966,0.59203394100836382,0.58485078611012964,0.57792221270143274,{"$f":"IF(AO12>AO14,SQRT(AO12*(AO22-AO23/2)^2+AO14*AO23^2/12),SQRT(AO12*(AO22-AO23/2)^2+AO12*AO23^2/12))","v":0.57123357474886716},0.56477137582523407,0.55852315598353497,0.55247739190414269,0.54662340851887004,0.54095130058950147,0.53545186294601377,0.53011652827964306,0.52493731154503032,0.51990676015934678,0.51501790929902025,0.51026424169002982,0.50563965136866618,0.50113841095851752,0.49675514206825444,0.49248478846511329,0.48832259172219694,0.48426406907489816,0.48030499325384546,0.34044328425354686,"Isw buck RMS",null,null,null,null,{"$f":"SQRT(BN20/3*BN23^2)","v":0.10691454531540599}]
[null,"Rth,j-a",30,"Enter junction to ambient thermal resistance",null,null,null,"I buck Diode avg",{"$f":"IF(I$12>I$14,(I22-I23/2)*(1-I12),I22*(I14-I12)+(I22-I23/2)*(1-I14))","v":0.41611155732664568},0.32054883666790157,0.3275145414448033,0.32582769724162547,0.31942114909853819,0.31054698464769476,0.30052609760822152,0.29014909051803983,0.27989405205516654,0.27004993340651035,0.26078886185506628,0.25221402544936361,0.24450885906189954,0.23869984279694542,0.16067536460898305,0.18588794888037485,0.2092819232955446,0.23104612375720146,0.25134426268648197,0.27031894881994001,0.28809496369876236,0.30478194941611364,0.32047662675669891,0.33526463624959729,0.34922207450651188,0.36241678284594653,0.37490943339095745,0.38675444868661946,0.3980007837618364,0.40869259397684277,0.41886980759376058,0.42856861851355171,{"$f":"IF(AO$12>AO$14,(AO22-AO23/2)*(1-AO12),AO22*(AO14-AO12)+(AO22-AO23/2)*(1-AO14))","v":0.4378219118352048},0.44665963265727998,0.45510910673968347,0.46319532018357018,0.47094116409910303,0.47836764925943864,0.48549409494183576,0.49233829549931968,0.49891666766218767,0.50524438111653858,0.51133547453001815,0.5172029588794993,0.52285890967052573,0.52831454941520628,0.53358032154667667,0.53866595678840135,0.54358053286071328,0.54833252829113333,0.55292987099598156,0.69112366568975026,"I buck Diode avg"]
[null,"Iout_PreReg",{"$f":"I_reg_ext+Vout_sync_buck*Iout_sync_buck/(0.88*Vreg)+Iout_3V3+Iout_V5A+Iout_V5B+Iout_V5CAN+Iout_V5P+Icc","v":0.83065420560747671},"Total VREG current",null,null,null,"I boost SW RMS",{"$f":"IF(I12>I14,SQRT(I14*(I22-I23/2)^2+I14*I23^2/12),SQRT(I14*(I22-I23/2)^2+I12*I23^2/12))","v":0},1.4640114227903234,1.2956951012254883,1.1515168236761697,1.0264835755208956,0.91684661001191159,0.81970955219546882,0.7327699382965609,0.65413919316007985,0.58220876326670379,0.51553965896926646,0.45275458601457796,0.39240637807054435,0.33274393690668042,0,0,0,0,0,0,0,0,0,0,0,0,0,0,0,0,0,0,{"$f":"IF(AO12>AO14,SQRT(AO14*(AO22-AO23/2)^2+AO14*AO23^2/12),SQRT(AO14*(AO22-AO23/2)^2+AO12*AO23^2/12))","v":0},0,0,0,0,0,0,0,0,0,0,0,0,0,0,0,0,0,0,0,"I boost SW RMS"]
[null,null,null,null,null,null,null,"I boost Diode avg",{"$f":"IF(I$12>I$14,I22*(1-I14)+I23/2*(I12-1),(I22-I23/2)*(1-I14))","v":0.91163165358932174},0.83065420560747683,0.83065420560747671,0.83065420560747671,0.83065420560747671,0.8306542056074766,0.8306542056074766,0.83065420560747671,0.8306542056074766,0.83065420560747671,0.83065420560747671,0.8306542056074766,0.83065420560747683,0.83065420560747683,0.88127613954597184,0.88700750373510984,0.89178911007356176,0.89577414817296452,0.89908826581115986,0.90183511371352965,0.90410065440041065,0.90595653632212125,0.90746275512281505,0.90866976689973056,0.90962017703574594,0.91035009798767663,0.9108902471382081,0.91126683925250695,0.91150231566251549,0.9116159429245595,0.91162430656467841,0.91154172006654577,{"$f":"IF(AO$12>AO$14,AO22*(1-AO14)+AO23/2*(AO12-1),(AO22-AO23/2)*(1-AO14))","v":0.91138056505038345},0.91115157533051416,0.91086407499681932,0.91052617867209407,0.91014496052624438,0.90972659738369732,0.90927649026970048,0.9087993679488735,0.90829937537292482,0.90778014944098229,0.90724488406006842,0.90669638615498538,0.90613712400075874,0.90556926902454005,0.90499473203786518,0.90441519470670695,0.90383213693975151,0.90324686076987515,0.90266051121598123,0.91672175495121577,"I boost Diode avg"]
[null,"A4411 Operating at Vin nom",null,null,null,null,null,"I Cout RMS",{"$f":"SQRT(((I22-I23/2-Iout_PreReg)^2+I23^2/12)*(1-I14)+Iout_PreReg^2*I14)","v":9.3681645219619733E-2},0.94934979731032387,0.87714381128964969,0.81115509958070853,0.75032562963017235,0.6937929988374042,0.64082002045290887,0.59074432771926866,0.54293757803453591,0.49676734087831048,0.45155415522316106,0.40651222946744198,0.36065226884067592,0.3125784653185586,3.623575264804469E-2,4.1915695672558408E-2,4.7184244113240889E-2,5.2084220862225819E-2,5.6652746078427504E-2,6.0922149170162018E-2,6.4920712472474343E-2,6.8673281495407162E-2,7.2201768665559427E-2,7.5525571495273683E-2,7.8661921571549026E-2,8.1626177285979831E-2,8.44320705562219E-2,8.7091915720367979E-2,8.9616787172214871E-2,9.201667103951075E-2,9.4300595208114499E-2,9.6476741201863808E-2,{"$f":"SQRT(((AO22-AO23/2-Iout_PreReg)^2+AO23^2/12)*(1-AO14)+Iout_PreReg^2*AO14)","v":9.8552540794908827E-2},0.10053475972535715,0.10242957046951094,0.10424261570412459,0.1059790638139803,0.10764365758121729,0.10924075701149821,0.11077437710257983,0.11224822123709746,0.11366571077855182,0.11503001136374456,0.11634405631316422,0.11761056752058156,0.1188320741323713,0.12001092928419684,0.12114932512635229,0.12224930633816304,0.12331278230550996,0.12434153811303231,0.29582154662804599]
[null,"Pdiss Total",{"$f":"IF(Topology=\"Buck\",I88,I3)","v":0.61834704090896708},"A4411 Power dissipation at nominal input voltage",null,null,"BUCK FET","Rds_On Buck",{"$f":"IF(I2>7,Buck_RdsON_factor_7V*(I4-150)+Rds_ON_150_7V,Buck_RdsON_factor_6V*(I4-150)+Rds_ON_150_6V)","v":0.17658504458045116},0.19494908713338838,0.19318457535736375,0.19189943432606249,0.19094073997520222,0.19021351308614323,0.18965594345917225,0.18922623673426056,0.18889522863598449,0.18864202485472334,0.1884513178988749,0.1883116656957281,0.18821405803319924,0.17514793527628775,0.17504257040484775,0.17508915766539734,0.17514416091260521,0.17520713264428628,0.17527768537619698,0.17535548196210349,0.17544022771815657,0.17553166397333231,0.17562956275512329,0.17573372238514398,0.17584396380875869,0.17596012752047233,0.17608207097567627,0.17620966640162655,0.17634279893785415,0.1764813650497673,0.17662527116988044,0.17677443252956257,{"$f":"IF(AO2>7,Buck_RdsON_factor_7V*(AO4-150)+Rds_ON_150_7V,Buck_RdsON_factor_6V*(AO4-150)+Rds_ON_150_6V)","v":0.17692877215093253},0.17708821997392582,0.17725271209789942,0.17742219012065619,0.17759660056062562,0.17777589435027172,0.17796002639070943,0.17814895515908882,0.1783426423616063,0.17854105262608505,0.17874415322896697,0.17895191385231113,0.17916430636702596,0.17938130463909424,0.17960288435599861,0.17982902287093616,0.18005969906273306,0.18029489320964651,0.18053458687547536,0.18864304248779865,"Rds_On Buck","BUCK FET"]
[null,"Tj estimate",{"$f":"IF(Reset=1,150,Ta+Rth_ja*Pdiss_total)","v":143.55041122726902},"Estimated A4411 junction temperature at nominal input voltage",null,null,null,"Conduction Losses",{"$f":"I25^2*I30","v":6.0805575762380971E-2},0.60009570381884203,0.48629057499444173,0.40227848107595959,0.33847264083078643,0.28891882495703552,0.24974216384514084,0.21832257713239903,0.19283176206814581,0.17195985847574238,0.15474724272234833,0.14047661353462382,0.12858312250876067,0.11028667191586108,9.741482115338948E-2,9.3773866353762364E-2,9.0399870427558746E-2,8.7264886537947381E-2,8.4344716012475771E-2,8.1618303824245966E-2,7.9067246753362533E-2,7.667539060723888E-2,7.4428498338126203E-2,7.2313974985444007E-2,7.0320638458374135E-2,6.8438527524248602E-2,6.6658740170209521E-2,6.49732968971789E-2,6.3375024587133982E-2,6.185745743140364E-2,6.0414752074436029E-2,5.9041614655614451E-2,{"$f":"AO25^2*AO30","v":5.7733237852396833E-2},5.6485246364990888E-2,5.5293649554027997E-2,5.4154800162144634E-2,5.3065358228764681E-2,5.2022259453032307E-2,5.1022687379304134E-2,5.006404887798499E-2,4.9143952475836111E-2,4.8260189157401219E-2,4.7410715315446647E-2,4.6593637575339054E-2,4.5807199257742362E-2,4.5049768277223248E-2,4.4319826302400687E-2,4.3615959027026072E-2,4.2936847421560426E-2,4.2281259852005981E-2,4.1648044967436029E-2,2.1864036073510396E-2,"Conduction Losses"]
[null,"T rise",{"$f":"Tj-Ta","v":18.550411227269024},"A4411 temperature rise at nominal input voltage",null,null,null,"Switching Losses",{"$f":"0.5*I2*Iout_PreReg*I19*10^3*(I2/SLEW_rate+I2/1.5)*10^-9","v":0.21264747663551403},1.8089802699896157E-2,2.1278032595452832E-2,2.4724888132886834E-2,2.843036931219816E-2,3.23944761333868E-2,3.6617208596452774E-2,4.1098566701396076E-2,4.5838550448216692E-2,5.0837159836914655E-2,5.6094394867489905E-2,6.1610255539942524E-2,6.7384741854272442E-2,7.3417853810479675E-2,7.9709591408564276E-2,8.6259954648526149E-2,9.3068943530365378E-2,0.10013655805408191,0.10746279821967579,0.11504766402714699,0.1228911554764955,0.13099327256772136,0.13935401530082453,0.14797338367580504,0.15685137769266289,0.16598799735139796,0.17538324265201041,0.18503711359450023,0.19494961017886736,0.20512073240511181,0.21555048027323356,0.22623885378323266,{"$f":"0.5*AO2*Iout_PreReg*AO19*10^3*(AO2/SLEW_rate+AO2/1.5)*10^-9","v":0.23718585293510908},0.24839147772886283,0.25985572816449393,0.27157860424200225,0.28356010596138803,0.29580023332265104,0.30829898632579145,0.32105636497080914,0.33407236925770417,0.34734699918647644,0.36088025475712604,0.3746721359696531,0.3887226428240575,0.40303177532033907,0.41759953345849804,0.43242591723853435,0.44751092666044801,0.46285456172423894,0.47845682242990711,1.00461988740763,"Switching Losses"]
[null,null,null,null,null,null,null,"Total Buck FET Losses",{"$f":"I31+I32","v":0.27345305239789502},{"$f":"J31+J32","v":0.61818550651873816},{"$f":"IF(K15=1/fsw*10^3,K30*K25^2,K31+K32)","v":0.50756860758989453},0.42700336920884641,0.3669030101429846,0.32131330109042233,0.2863593724415936,0.25942114383379511,0.2386703125163625,0.22279701831265702,0.21084163758983823,0.20208686907456636,0.1959678643630331,0.18370452572634077,0.17712441256195377,0.18003382100228851,0.18346881395792414,0.18740144459202929,0.19180751423215156,0.19666596785139295,0.20195840222985803,0.20766866317496024,0.21378251363895073,0.22028735866124904,0.22717201615103702,0.23442652487564658,0.24204198282221995,0.25001041049167916,0.25832463476600132,0.26697818983651544,0.27596523234766956,0.28528046843884713,0.29491909078750589,0.30487672409385369,{"$f":"IF(AQ15=1/fsw*10^3,AQ30*AQ25^2,AQ31+AQ32)","v":0.31514937771852192},0.32573340440414689,0.33662546419015271,0.34782249277568333,0.3593216737050956,0.37112041384879413,0.38321632173354025,0.39560718834387765,0.4082909700725727,0.42126577354499217,0.43452984208179984,0.4480815435975623,0.46191935976089871,0.47604187626556044,0.49044777408200846,0.50513582157624493,0.52010486739734318,1.0264839234811403,"Total Buck FET Losses"]
[null,"Tj (MAX):",{"$f":"IF(Topology=\"Buck\",MAX(J89:BH89),MAX(J4:BH4))","v":166.32351317748896},"Maximum junction temperature at worse case input voltage",null,null,"3V3 LDO","Output voltage",{"$f":"IF(I21-Iout_3V3*I35>3.3,3.3,I21-Iout_3V3*I35)","v":3.3},3.3,3.3,3.3,3.3,3.3,3.3,3.3,3.3,3.3,3.3,3.3,3.3,3.3,3.3,3.3,3.3,3.3,3.3,3.3,3.3,3.3,3.3,3.3,3.3,3.3,3.3,3.3,3.3,3.3,3.3,3.3,{"$f":"IF(AO21-Iout_3V3*AO35>3.3,3.3,AO21-Iout_3V3*AO35)","v":3.3},3.3,3.3,3.3,3.3,3.3,3.3,3.3,3.3,3.3,3.3,3.3,3.3,3.3,3.3,3.3,3.3,3.3,3.3,3.3,"Output voltage","5V0 LDO"]
[null,null,{"$f":"IF(Topology=\"Buck\",HLOOKUP(C34,J89:BH90,2,FALSE),HLOOKUP(C34,J4:BH5,2,FALSE))","v":36},null,null,null,null,"Series pass resistance",{"$f":"(Rds_ON_3V3_150-Rds_ON_3V3_min40)/190*(I4-150)+Rds_ON_3V3_150","v":0.4970358276454272},0.50667655421223812,0.5035830617676943,0.50132998863748235,0.49964923265086331,0.49837427891162472,0.49739676351514039,0.49664341376426552,0.49606309967114742,0.49561918991950726,0.49528484784536808,0.49504001352849442,0.49486889051834204,0.49452593614484563,0.49434191785582543,0.49442328186129814,0.49451934427093636,0.49462932352837025,0.49475254289773374,0.49488841355779789,0.49503642084730037,0.49519611300087957,0.49536709186770805,0.49554900521927792,0.49574154033914741,0.49594441865317779,0.49615739120918395,0.49638023485383775,0.49661274898492053,0.49685475278070135,0.49710608282686225,0.49736659107616293,{"$f":"(Rds_ON_3V3_150-Rds_ON_3V3_min40)/190*(AO4-150)+Rds_ON_3V3_150","v":0.49763614308779991},0.49791461650284058,0.49820189971969675,0.49849789073973971,0.4988024961581472,0.49911563027914696,0.49943721433816074,0.49976717581610614,0.50010544783338529,0.50045196861298125,0.500806681003653,0.50116953205553638,0.50154047264156243,0.50191945711903196,0.50230644302647021,0.5027013908115493,0.50310426358643168,0.5035150269073666,0.50393364857578404,0.5180949540278148,"Series pass resistance"]
[null,null,null,null,null,null,null,"Power dissipated",{"$f":"(I21-I34)*Iout_3V3","v":0},0,0,0,0,0,0,0,0,0,0,0,0,0,0,0,0,0,0,0,0,0,0,0,0,0,0,0,0,0,0,0,{"$f":"(AO21-AO34)*Iout_3V3","v":0},0,0,0,0,0,0,0,0,0,0,0,0,0,0,0,0,0,0,0,"Power dissipated"]
[null,"Inductor Calculation, Pre-Regulator",null,null,null,null,"Adj BUCK","V1",{"$f":"IF(Reset=1,Vreg-Vout_sync_buck,Vreg-Iout_sync_buck*(I49+DCR2*10^-3)-Vout_sync_buck)","v":1.8423904687936838},1.838526419494583,1.8397663060559619,1.8406693485382153,1.8413430035731384,1.8418540111272215,1.8422458039715135,1.8425477501533356,1.8427803428162681,1.8429582639670024,1.843092269868766,1.8431904006334916,1.8432589875540781,1.8433964453065981,1.8434702007166068,1.8434375896342221,1.8433990873611759,1.8433550071489995,1.843305620236662,1.8432511626265278,1.8431918405972905,1.8431278352186675,1.8430593060714138,1.8429863943303992,1.8429092253338686,1.8428279107356689,1.8427425503170261,1.8426532335188615,1.8425600407435017,1.8424630444651626,1.8423623101810831,1.842257897229306,{"$f":"IF(Reset=1,Vreg-Vout_sync_buck,Vreg-Iout_sync_buck*(AO49+DDX2*10^-3)-Vout_sync_buck)","v":1.8421498594943468},1.8420382460182516,1.8419231015314699,1.8418044669155407,1.8416823796075619,1.8415568739548096,1.8414279815265031,1.8412957313886373,1.8411601503468757,1.84102126316174,1.8408790927397227,1.8407336603033819,1.8405849855430816,1.8404330867526335,1.840277980950801,1.8401196839903449,1.8399582106560866,1.839793574753247,1.839625789187167,1.8339498702585404]
[null,"Ripple Current",0.35,"Select desired inductor ripple current, 20% to 45%",null,null,null,"V3",{"$f":"IF(Reset=1,Vout_sync_buck,Vout_sync_buck+Iout_sync_buck*(I53+dcr_2*10^-3))","v":3.4411095312063158},3.4449735805054162,3.4437336939440382,3.4428306514617848,3.4421569964268608,3.4416459888727777,3.4412541960284866,3.4409522498466636,3.440719657183732,3.4405417360329968,3.4404077301312337,3.440309599366508,3.4402410124459211,3.4401035546934011,3.4400297992833933,3.440062410365778,3.4401009126388233,3.4401449928510002,3.4401943797633376,3.4402488373734723,3.4403081594027096,3.4403721647813326,3.4404406939285863,3.4405136056696004,3.4405907746661311,3.4406720892643303,3.4407574496829731,3.4408467664811386,3.4409399592564975,3.441036955534837,3.4411376898189161,3.4412421027706936,{"$f":"IF(Reset=1,Vout_sync_buck,Vout_sync_buck+Iout_sync_buck*(AO53+dcr_2*10^-3))","v":3.4413501405056524},3.441461753981748,3.4415768984685293,3.441695533084459,3.4418176203924378,3.44194312604519,3.4420720184734965,3.4422042686113619,3.4423398496531243,3.4424787368382592,3.4426209072602765,3.4427663396966177,3.4429150144569181,3.4430669132473657,3.4432220190491987,3.4433803160096552,3.4435417893439131,3.4437064252467522,3.4438742108128326,3.4495501297414588]
[null,"L calculated",{"$f":"ROUNDUP((Vin_nom-Vreg)*Vreg/(Vin_nom*fsw*10^-3*k_ripple*Iout_PreReg),2)","v":5.0999999999999996},"Recommended minimum inductor value",null,null,null,"Required Buck duty",{"$f":"IF(Reset=1,Vout_sync_buck/Vreg,I38/(I37+I38))","v":0.65129356131471861},0.65202490404190716,0.65179023260036684,0.65161931512478177,0.65149181346207274,0.65139509584040467,0.65132094180533484,0.65126379291126413,0.65121977045211166,0.65118609558682639,0.65116073249384565,0.65114215943342635,0.65112917809140181,0.65110316167188453,0.65108920209773691,0.6510953743476442,0.65110266161423747,0.65111100460887672,0.65112035199457508,0.65113065910352463,0.65114188689367081,0.65115400109422406,0.65116697150157776,0.65118077139577935,0.65119537705425024,0.65121076734443661,0.65122692338089783,0.65124382823528693,0.65126146668997786,0.65127982502788628,0.65129889085244941,0.6513186529328463,{"$f":"IF(Reset=1,Vout_sync_buck/Vreg,AO38/(AO37+AO38))","v":0.6513391010704368},0.65136022598310739,0.6513820192047941,0.65140447299791027,0.65142758027679337,0.65145133454058668,0.6514757298142323,0.65150076059645357,0.6515264218137834,0.65155270877983529,0.6515796171591326,0.65160714293491395,0.65163528238041413,0.65166403203319134,0.65169338867213,0.65172334929680231,0.65175391110890757,0.65178507149555276,0.65181682801416341,0.65289110054726207]
[null,"Irms",{"$f":"IF(Topology=\"buck\",MAX(J104:BG104),MAX(J24:BG24))","v":1.9225316797397451},"Maximum RMS inductor current, must be less than inductor DC rating",null,null,null,"ton buck",{"$f":"I39/(fsw*10^3)*10^6","v":0.3256467806573593},0.32601245202095358,0.32589511630018342,0.32580965756239089,0.32574590673103637,0.32569754792020233,0.32566047090266742,0.32563189645563206,0.32560988522605583,0.32559304779341319,0.32558036624692283,0.32557107971671317,0.3255645890457009,0.32555158083594227,0.32554460104886845,0.3255476871738221,0.32555133080711873,0.32555550230443836,0.32556017599728754,0.32556532955176232,0.3255709434468354,0.32557700054711203,0.32558348575078888,0.32559038569788967,0.32559768852712512,0.32560538367221831,0.32561346169044891,0.32562191411764346,0.32563073334498893,0.32563991251394314,0.3256494454262247,0.32565932646642315,{"$f":"AO39/(fsw*10^3)*10^6","v":0.3256695505352184},0.32568011299155369,0.32569100960239705,0.32570223649895513,0.32571379013839669,0.32572566727029334,0.32573786490711615,0.32575038029822678,0.3257632109068917,0.32577635438991764,0.3257898085795663,0.32580357146745698,0.32581764119020706,0.32583201601659567,0.325846694336065,0.32586167464840116,0.32587695555445378,0.32589253574777638,0.3259084140070817,0.32644555027363104]
[null,"Ipk",{"$f":"IF(Topology=\"buck\",MAX(J102:BG102),MAX(J22:BG22))","v":2.0147495423065558},"Maximum peak inductor current, must be less than inductor saturation current",null,null,null,"toff buck",{"$f":"1/(fsw*10^-3)-I40","v":0.1743532193426407},0.17398754797904642,0.17410488369981658,0.17419034243760911,0.17425409326896363,0.17430245207979767,0.17433952909733258,0.17436810354436794,0.17439011477394417,0.17440695220658681,0.17441963375307717,0.17442892028328683,0.1744354109542991,0.17444841916405773,0.17445539895113155,0.1744523128261779,0.17444866919288127,0.17444449769556164,0.17443982400271246,0.17443467044823768,0.1744290565531646,0.17442299945288797,0.17441651424921112,0.17440961430211033,0.17440231147287488,0.17439461632778169,0.17438653830955109,0.17437808588235654,0.17436926665501107,0.17436008748605686,0.1743505545737753,0.17434067353357685,{"$f":"1/(fsw*10^-3)-AO40","v":0.1743304494647816},0.17431988700844631,0.17430899039760295,0.17429776350104487,0.17428620986160331,0.17427433272970666,0.17426213509288385,0.17424961970177322,0.1742367890931083,0.17422364561008236,0.1742101914204337,0.17419642853254302,0.17418235880979294,0.17416798398340433,0.174153305663935,0.17413832535159884,0.17412304444554622,0.17410746425222362,0.1740915859929183,0.17355444972636896]
[null,"DCR <",{"$f":"ROUNDDOWN(0.033*Vreg*Iout_PreReg/C40^2*1000,0)","v":39},"Recommended inductor DC resistance",null,null,null,"VREG_actual",{"$f":"I37*I39/(1-I39)-Iout_sync_buck*(I53+dcr_2*10^-3)","v":3.2999999999999989},3.2999999999999989,3.3,3.2999999999999989,3.3000000000000003,3.2999999999999994,3.3000000000000003,3.2999999999999994,3.3,3.2999999999999994,3.2999999999999989,3.2999999999999989,3.2999999999999989,3.3000000000000007,3.2999999999999994,3.3000000000000003,3.2999999999999994,3.2999999999999989,3.299999999999998,3.3,3.3000000000000007,3.3000000000000007,3.2999999999999994,3.2999999999999985,3.2999999999999989,3.2999999999999994,3.2999999999999994,3.3,3.3,3.2999999999999994,3.2999999999999994,3.2999999999999985,{"$f":"AO37*AO39/(1-AO39)-Iout_sync_buck*(AO53+dcr_2*10^-3)","v":3.3},3.2999999999999989,3.2999999999999994,3.2999999999999985,3.2999999999999994,3.299999999999998,3.2999999999999989,3.3000000000000003,3.3000000000000003,3.2999999999999994,3.3,3.3,3.2999999999999994,3.3000000000000003,3.3,3.2999999999999994,3.2999999999999994,3.3000000000000007,3.299999999999998,3.2999999999999994]
[null,"Lout = ",4.7,"Enter selected inductor value at total VREG current",null,null,null,"Ilpk",{"$f":"Iout_sync_buck+I44/2","v":0.76382643881664525},0.7637640963962482,0.76378413343375173,0.76379870746093881,0.76380956875550865,0.76381780160118351,0.76382411021700269,0.76382897002047745,0.76383271233204642,0.76383557426819926,0.76383772938837713,0.76383930732529004,0.76384041008381254,0.76384261988052327,0.76384380542954944,0.76384328125050061,0.76384266235096365,0.76384195375295683,0.76384115980223788,0.76384028427735895,0.7638393304783796,0.76383830129950903,0.76383719928895322,0.76383602669851036,0.76383478552489592,0.76383347754435738,0.76383210434180981,0.76383066733547622,0.76382916779781684,0.76382760687338391,0.76382598559411141,0.76382430489246211,{"$f":"Iout_sync_buck+AO44/2","v":0.76382256561277018},0.76382076852106251,0.76381891431359172,0.76381700362427196,0.7638150370311787,0.76381301506224741,0.76381093820028334,0.76380880688737762,0.76380662152880996,0.76380438249650551,0.76380209013210631,0.7637997447497028,0.76379734663827215,0.76379489606385709,0.76379239327151771,0.76378983848708293,0.76378723191872611,0.76378457375838316,0.76378186418303351,0.76368986963519181]
[null,"Lout DCR",37,"Enter selected inductor DC resistance",null,null,null,"ΔIL",{"$f":"I37*I39/(L_buck2*10^-6*fsw*10^3)","v":0.12765287763329067},0.12752819279249644,0.1275682668675035,0.12759741492187765,0.12761913751101744,0.12763560320236705,0.12764822043400559,0.12765794004095504,0.12766542466409295,0.12767114853639872,0.12767545877675429,0.1276786146505802,0.12768082016762514,0.1276852397610467,0.12768761085909899,0.12768656250100135,0.12768532470192742,0.12768390750591363,0.12768231960447593,0.12768056855471796,0.12767866095675934,0.1276766025990182,0.12767439857790661,0.12767205339702076,0.12766957104979199,0.12766695508871487,0.1276642086836198,0.12766133467095248,0.12765833559563386,0.12765521374676783,0.12765197118822297,0.1276486097849244,{"$f":"AO37*AO39/(L_buck2*10^-6*fsw*10^3)","v":0.12764513122554036},0.12764153704212503,0.12763782862718359,0.12763400724854412,0.12763007406235755,0.12762603012449486,0.12762187640056674,0.12761761377475539,0.12761324305761992,0.12760876499301121,0.12760418026421275,0.12759948949940564,0.1275946932765443,0.12758979212771418,0.12758478654303543,0.12757967697416606,0.1275744638374523,0.12756914751676635,0.12756372836606714,0.12737973927038371]
[null,"Ripple",{"$f":"I103/Iout_PreReg","v":0.38925155505703507},"Actual inductor ripple current at nominal input voltage",null,null,null,"IL RMS",{"$f":"SQRT((I43-I44/2)^2+I44^2/12)","v":0.70096928470321596},{"$f":"SQRT((J43-J44/2)^2+J44^2/12)","v":0.7009673934378664},0.70096800109512714,0.70096844319690699,0.70096877273878699,0.70096902256833193,0.70096921402797518,0.70096936153060563,0.70096947512324326,0.70096956199779714,0.70096962741939672,0.70096967532121124,0.70096970879862064,0.7009697758850969,0.7009698118777361,0.70096979596385611,0.7009697771744654,0.70096975566210995,0.70096973155881104,0.7009697049793745,0.70096967602408389,0.70096964478090551,0.70096961132730462,0.700969575731751,0.70096953805497364,0.70096949835101141,0.70096945666809751,0.70096941304940741,0.70096936753369421,0.7009693201558308,0.70096927094727424,0.70096921993646433,0.70096916714916835,0.70096911260877937,0.70096905633657502,0.70096899835194337,0.70096893867258014,0.70096887731466229,0.70096881429299929,0.70096874962116784,0.70096868331162998,0.70096861537583843,0.70096854582432944,0.70096847466680623,0.70096840191221255,0.70096832756879923,0.70096825164418297,0.70096817414540014,0.70096809507895419,0.70096801445085888,0.7009679322666772,0.70096514404406429]
[null,null,null,null,null,null,null,"I_hi_sw buck RMS",{"$f":"SQRT(I39*((I43-I44/2)^2+I44^2/12))","v":0.56570156565425245},{"$f":"SQRT(J39*((J43-J44/2)^2+J44^2/12))","v":0.56601756477778697},0.56591618800064647,0.56584234055353677,0.56578724494876242,0.56574544787665559,0.56571339958558708,0.56568869936404653,0.56566967172139349,0.56565511612096586,0.56564415293492565,0.56563612459567136,0.56563051324578517,0.56561926714176913,0.56561323274694419,0.56561590087343394,0.56561905097980691,0.56562265742881113,0.56562669801992083,0.56563115343503778,0.56563600678750436,0.56564124325277276,0.56564684976407953,0.56565281476022222,0.56565912797536966,0.5656657802629862,0.56567276344760697,0.56568007019947608,0.5656876939280483,0.5656956286911371,0.56570386911709691,0.56571241033791619,0.56572124793148293,0.56573037787158897,0.56573979648449635,0.56574950041108096,0.56575948657373953,0.5657697521473749,0.56578029453388834,0.56579111133969229,0.56580220035583673,0.56581355954040269,0.56582518700286533,0.56583708099017616,0.56584923987434776,0.56586166214135514,0.56587434638119416,0.56588729127895954,0.56590049560682021,0.56591395821679225,0.56592767803421484,0.56639159154965935]
[null,"Output Capacitor, Pre-Regulator",null,null,null,null,null,"I_lo_sw buck RMS",{"$f":"SQRT((1-I39)*((I43-I44/2)^2+I44^2/12))","v":0.41393197111803981},{"$f":"SQRT((1-J39)*((J43-J44/2)^2+J44^2/12))","v":0.41349655745374747},0.41363632180711007,0.41373808622701236,0.41381398454886748,0.41387154868055975,0.41391567806053825,0.41394968440190683,0.41397587797982399,0.4139959135710885,0.41401100325355888,0.41402205288162414,0.4140297756665971,0.41404525277125315,0.41405355704964047,0.41404988531908077,0.41404555024866807,0.41404058708799063,0.41403502635491224,0.41402889459869829,0.41402221502087966,0.41401500798367968,0.41400729142893766,0.41399908122529533,0.41399039145751609,0.41398123466883813,0.41397162206498589,0.41396156368671055,0.41395106855636199,0.41394014480292529,0.41392879976911451,0.41391704010344915,0.41390487183970714,0.41389230046572356,0.41387933098316115,0.41386596795960279,0.41385221557408891,0.41383807765704222,0.41382355772536666,0.41380865901338926,0.41379338450020414,0.41377773693389935,0.41376171885307067,0.41374533260597124,0.4137285803675933,0.41371146415493765,0.41369398584069217,0.41367614716550677,0.41365794974903236,0.41363939509986508,0.41362048462452022,0.41298026367680046]
[null,"Vripple",0.01,"Enter VREG maximum output switching frequency ripple",null,null,null,"I cout RMS",{"$f":"SQRT(((I43-I44/2-Iout_sync_buck)^2+I44^2/12))","v":3.6850211632205365E-2},3.6814218219007155E-2,3.6825786608003584E-2,3.6834200926523217E-2,3.6840471697866896E-2,3.6845224933533441E-2,3.6848867214574907E-2,3.6851673023419247E-2,3.6853833648010974E-2,3.6855485987619251E-2,3.685673024683403E-2,3.6857641269135488E-2,3.6858277947065282E-2,3.6859553773791111E-2,3.6860238250840491E-2,3.685993561592555E-2,3.6859578294111288E-2,3.6859169184861255E-2,3.6858710797200003E-2,3.6858205312675439E-2,3.6857654636577981E-2,3.6857060439880011E-2,3.6856424193788977E-2,3.6855747198381104E-2,3.6855030606460733E-2,3.68542754435447E-2,3.6853482624684228E-2,3.6852652968690655E-2,3.6851787210219394E-2,3.6850886010077806E-2,3.6849949964053441E-2,3.6848979610503804E-2,{"$f":"SQRT(((AO43-AO44/2-Iout_sync_buck)^2+AO44^2/12))","v":3.684797543690542E-2},3.6846937885524234E-2,3.6845867358341881E-2,3.6844764221348796E-2,3.6843628808297002E-2,3.6842461423990197E-2,3.6841262347176176E-2,3.6840031833096358E-2,3.6838770115739002E-2,3.6837477409835361E-2,3.6836153912632383E-2,3.6834799805470338E-2,3.6833415255190287E-2,3.6832000415392085E-2,3.6830555427561223E-2,3.6829080422080135E-2,3.682757551913763E-2,3.6826040829548067E-2,3.6824476455490578E-2,3.6771363378530188E-2]
[null,"I Step",0.7,"Enter worst case transient load step",null,null,"Adj BUCK High Side FET","Rds_On Buck",{"$f":"Buck_RdsON_factor_7V*(I4-150)+Adj_buck_hi_rdsON_150","v":0.29658504458045115},0.30210511500773807,0.30033384849148309,0.29904378780254975,0.2980814234669445,0.29735141267539711,0.29679170861212384,0.29636035692380558,0.29602808169104594,0.29577390861856728,0.2955824716160485,0.29544228480929763,0.29534430349417329,0.29514793527628774,0.29504257040484771,0.29508915766539734,0.2951441609126052,0.29520713264428627,0.29527768537619697,0.29535548196210348,0.29544022771815659,0.2955316639733323,0.29562956275512331,0.29573372238514395,0.29584396380875871,0.29596012752047235,0.29608207097567629,0.29620966640162655,0.29634279893785415,0.2964813650497673,0.29662527116988047,0.29677443252956259,{"$f":"Buck_RdsON_factor_7V*(AO4-150)+Adj_buck_hi_rdsON_150","v":0.2969287721509325},0.29708821997392582,0.29725271209789944,0.29742219012065618,0.29759660056062565,0.29777589435027169,0.29796002639070945,0.29814895515908885,0.29834264236160629,0.29854105262608505,0.29874415322896697,0.29895191385231112,0.29916430636702596,0.29938130463909424,0.29960288435599858,0.29982902287093616,0.30005969906273305,0.30029489320964647,0.30053458687547535,0.30864304248779867]
[null,"V transient",0.05,"Enter maximum VREG deviation due to load step",null,null,null,"Conduction Losses",{"$f":"I46^2*I49","v":9.4912630319034977E-2},{"$f":"J46^2*J49","v":9.6787193171854427E-2},9.6185258248100758E-2,9.5747108626099614E-2,9.5420396440858535E-2,9.5172645723759816E-2,9.4982740353151754E-2,9.483641210869502E-2,9.4723710182244084E-2,9.4637508787097674E-2,9.4572589506318416E-2,9.4525052977782881E-2,9.4491829595980334E-2,9.4425249048037521E-2,9.4389526125028642E-2,9.4405320900093445E-2,9.4423969362343319E-2,9.444531996387108E-2,9.4469241517697769E-2,9.4495619914091972E-2,9.4524355449117206E-2,9.4555360637030753E-2,9.4588558407837697E-2,9.4623880613531094E-2,9.4661266783335127E-2,9.4700663081036349E-2,9.4742021427284731E-2,9.4785298757305597E-2,9.4830456390342779E-2,9.4877459491755051E-2,9.4926276612309013E-2,9.4976879292081595E-2,9.5029241718670804E-2,9.5083340431242613E-2,9.5139154063417247E-2,9.5196663119188243E-2,9.5255849777037355E-2,9.5316697718199783E-2,9.5379191975682856E-2,9.5443318801174473E-2,9.5509065547421321E-2,9.5576420564022296E-2,9.5645373104887646E-2,9.571591324587117E-2,9.5788031811295651E-2,9.5861720308272863E-2,9.5936970867871507E-2,9.6013776192315589E-2,9.6092129507504301E-2,9.6172024520240054E-2,9.6253455379628261E-2,9.9012513640024863E-2]
[null,"VIN min for transient",6,"Enter minimum input voltage for load transient spec",null,null,null,"Switching Losses",{"$f":"0.5*Vreg*Iout_sync_buck*fsw*10^3*(Vreg/SLEW_rate+Vreg/1.5)*10^-9","v":3.5619111111111101E-2},3.5619111111111101E-2,3.5619111111111101E-2,3.5619111111111101E-2,3.5619111111111101E-2,3.5619111111111101E-2,3.5619111111111101E-2,3.5619111111111101E-2,3.5619111111111101E-2,3.5619111111111101E-2,3.5619111111111101E-2,3.5619111111111101E-2,3.5619111111111101E-2,3.5619111111111101E-2,3.5619111111111101E-2,3.5619111111111101E-2,3.5619111111111101E-2,3.5619111111111101E-2,3.5619111111111101E-2,3.5619111111111101E-2,3.5619111111111101E-2,3.5619111111111101E-2,3.5619111111111101E-2,3.5619111111111101E-2,3.5619111111111101E-2,3.5619111111111101E-2,3.5619111111111101E-2,3.5619111111111101E-2,3.5619111111111101E-2,3.5619111111111101E-2,3.5619111111111101E-2,3.5619111111111101E-2,{"$f":"0.5*Vreg*Iout_sync_buck*fsw*10^3*(Vreg/SLEW_rate+Vreg/1.5)*10^-9","v":3.5619111111111101E-2},3.5619111111111101E-2,3.5619111111111101E-2,3.5619111111111101E-2,3.5619111111111101E-2,3.5619111111111101E-2,3.5619111111111101E-2,3.5619111111111101E-2,3.5619111111111101E-2,3.5619111111111101E-2,3.5619111111111101E-2,3.5619111111111101E-2,3.5619111111111101E-2,3.5619111111111101E-2,3.5619111111111101E-2,3.5619111111111101E-2,3.5619111111111101E-2,3.5619111111111101E-2,3.5619111111111101E-2,3.5619111111111101E-2]
[null,"Output Capacitor",{"$f":"ROUNDUP(MAX(X166:X168),0)","v":43},"Minimum output capacitance required",null,null,null,"Total Buck FET Losses",{"$f":"I50+I51","v":0.13053174143014606},{"$f":"J50+J51","v":0.13240630428296551},0.13180436935921186,0.13136621973721072,0.13103950755196964,0.13079175683487093,0.13060185146426284,0.13045552321980614,0.13034282129335517,0.13025661989820878,0.13019170061742952,0.13014416408889398,0.13011094070709145,0.13004436015914861,0.13000863723613976,0.13002443201120456,0.13004308047345442,0.13006443107498217,0.13008835262880886,0.13011473102520307,0.13014346656022829,0.13017447174814184,0.1302076695189488,0.13024299172464221,0.13028037789444624,0.13031977419214746,0.13036113253839582,0.1304044098684167,0.13044956750145387,0.13049657060286615,0.13054538772342011,0.1305959904031927,0.13064835282978191,0.13070245154235371,0.13075826517452835,0.13081577423029933,0.13087496088814846,0.13093580882931088,0.13099830308679394,0.13106242991228556,0.13112817665853244,0.1311955316751334,0.13126448421599873,0.13133502435698227,0.13140714292240674,0.13148083141938396,0.13155608197898261,0.1316328873034267,0.13171124061861539,0.13179113563135114,0.13187256649073936,0.13463162475113596]
[null,"ESR",{"$f":"ROUNDUP(C48/(2*C54)*1000,0)","v":6},"Maximum series equivalent resistance for output capacitor",null,null,"Adj BUCK Low Side FET","Rds_On Buck",{"$f":"Buck_RdsON_factor_7V*(I4-150)+Adj_buck_lo_rdsON_150","v":0.10658504458045115},0.11210511500773809,0.11033384849148312,0.10904378780254977,0.10808142346694452,0.10735141267539709,0.10679170861212382,0.10636035692380556,0.10602808169104597,0.10577390861856727,0.10558247161604849,0.10544228480929764,0.10534430349417329,0.10514793527628777,0.10504257040484775,0.10508915766539734,0.10514416091260523,0.10520713264428629,0.10527768537619699,0.10535548196210349,0.10544022771815657,0.10553166397333232,0.10562956275512329,0.10573372238514397,0.10584396380875871,0.10596012752047235,0.10608207097567629,0.10620966640162656,0.10634279893785417,0.10648136504976731,0.10662527116988045,0.10677443252956258,{"$f":"Buck_RdsON_factor_7V*(AO4-150)+Adj_buck_lo_rdsON_150","v":0.10692877215093252},0.10708821997392581,0.10725271209789944,0.10742219012065619,0.10759660056062564,0.10777589435027171,0.10796002639070944,0.10814895515908884,0.1083426423616063,0.10854105262608506,0.10874415322896698,0.10895191385231115,0.10916430636702598,0.10938130463909423,0.10960288435599862,0.10982902287093615,0.11005969906273305,0.1102948932096465,0.11053458687547538,0.11864304248779865]
[null,"I RMS",{"$f":"ROUNDUP(IF(Topology=\"Buck\",MAX(J107:BG107),MAX(J29:BG29)),3)","v":0.95},"Maximum RMS current in output capacitor",null,null,null,"Conduction Losses",{"$f":"I47^2*I53","v":1.826224708092615E-2},{"$f":"J47^2*J53","v":1.9167665640195376E-2},1.8877570548885798E-2,1.8666028796617339E-2,1.8508080609737541E-2,1.8388186849644519E-2,1.829621640465029E-2,1.822530889222394E-2,1.817067144886993E-2,1.8128866950656023E-2,1.8097375247472323E-2,1.8074311252008448E-2,1.8058189520083607E-2,1.8025875548901157E-2,1.8008534836099377E-2,1.8016202241039739E-2,1.8025254397668004E-2,1.8035617482361131E-2,1.8047227536576001E-2,1.806002887555774E-2,1.8073972793497012E-2,1.8089016503025392E-2,1.8105122261285952E-2,1.8122256645564598E-2,1.8140389949585375E-2,1.8159495677752407E-2,1.8179550119359365E-2,1.8200531988447968E-2,1.8222422117842689E-2,1.8245203198116421E-2,1.8268859553996417E-2,1.8293376952109232E-2,1.8318742435070687E-2,1.8344944177813721E-2,1.8371971362760815E-2,1.8399814071025589E-2,1.8428463187297503E-2,1.8457910316447428E-2,1.8488147710206012E-2,1.8519168202526227E-2,1.8550965152455242E-2,1.8583532393519068E-2,1.8616864188771128E-2,1.8650955190780086E-2,1.868580040593602E-2,1.8721395162541562E-2,1.8757735082228683E-2,1.8794816054303845E-2,1.8832634212678178E-2,1.8871185915083973E-2,1.8910467724317773E-2,2.0234891017356694E-2]
[null,"Actual Capacitor value =",8.5,"Enter minimum capacitance value of ceramic capacitor with tolerance and DC bias",null,null,null,"Body Diode Losses",{"$f":"(I43-I44/2)*(2*td*10^-9*(fsw*10^3))*0.05","v":2.1000000000000003E-3},2.1000000000000003E-3,2.1000000000000003E-3,2.1000000000000003E-3,2.1000000000000003E-3,2.1000000000000003E-3,2.1000000000000003E-3,2.1000000000000003E-3,2.1000000000000003E-3,2.1000000000000003E-3,2.1000000000000003E-3,2.1000000000000003E-3,2.1000000000000003E-3,2.1000000000000003E-3,2.1000000000000003E-3,2.1000000000000003E-3,2.1000000000000003E-3,2.1000000000000003E-3,2.1000000000000003E-3,2.1000000000000003E-3,2.1000000000000003E-3,2.1000000000000003E-3,2.1000000000000003E-3,2.1000000000000003E-3,2.1000000000000003E-3,2.1000000000000003E-3,2.1000000000000003E-3,2.1000000000000003E-3,2.1000000000000003E-3,2.1000000000000003E-3,2.1000000000000003E-3,2.1000000000000003E-3,{"$f":"(AO43-AO44/2)*(2*td*10^-9*(fsw*10^3))*0.05","v":2.1000000000000003E-3},2.1000000000000003E-3,2.1000000000000003E-3,2.1000000000000003E-3,2.1000000000000003E-3,2.1000000000000003E-3,2.1000000000000003E-3,2.1000000000000003E-3,2.1000000000000003E-3,2.1000000000000003E-3,2.1000000000000003E-3,2.1000000000000003E-3,2.1000000000000003E-3,2.1000000000000003E-3,2.1000000000000003E-3,2.1000000000000003E-3,2.1000000000000003E-3,2.1000000000000003E-3,2.1000000000000003E-3,2.1000000000000003E-3]
[null,"Estimated ESR",3,"Enter estimated equivalent series resistance of output capacitor used",null,null,null,"Total Buck FET Losses",{"$f":"I54+I55","v":2.0362247080926151E-2},{"$f":"J54+J55","v":2.1267665640195377E-2},2.0977570548885799E-2,2.076602879661734E-2,2.0608080609737543E-2,2.048818684964452E-2,2.0396216404650291E-2,2.0325308892223941E-2,2.0270671448869931E-2,2.0228866950656024E-2,2.0197375247472324E-2,2.0174311252008449E-2,2.0158189520083608E-2,2.0125875548901159E-2,2.0108534836099378E-2,2.011620224103974E-2,2.0125254397668005E-2,2.0135617482361132E-2,2.0147227536576003E-2,2.0160028875557741E-2,2.0173972793497013E-2,2.0189016503025393E-2,2.0205122261285954E-2,2.0222256645564599E-2,2.0240389949585377E-2,2.0259495677752409E-2,2.0279550119359366E-2,2.0300531988447969E-2,2.032242211784269E-2,2.0345203198116422E-2,2.0368859553996418E-2,2.0393376952109233E-2,2.0418742435070688E-2,2.0444944177813722E-2,2.0471971362760816E-2,2.049981407102559E-2,2.0528463187297504E-2,2.0557910316447429E-2,2.0588147710206013E-2,2.0619168202526229E-2,2.0650965152455243E-2,2.0683532393519069E-2,2.0716864188771129E-2,2.0750955190780088E-2,2.0785800405936021E-2,2.0821395162541563E-2,2.0857735082228684E-2,2.0894816054303846E-2,2.0932634212678179E-2,2.0971185915083974E-2,2.1010467724317774E-2,2.2334891017356695E-2]
[null,"Number of capacitors =",5,"Enter the number of parallel ceramic capacitors",null,null,"V5A LDO","Output voltage",{"$f":"IF(I21-5<I58*Iout_V5A,I21-I58*Iout_V5A,5)","v":5},5,5,5,5,5,5,5,5,5,5,5,5,5,5,5,5,5,5,5,5,5,5,5,5,5,5,5,5,5,5,5,{"$f":"IF(AO21-5<AO58*Iout_V5A,AO21-AO58*Iout_V5A,5)","v":5},5,5,5,5,5,5,5,5,5,5,5,5,5,5,5,5,5,5,5,"Output voltage","V5 LDO"]
[null,null,null,null,null,null,null,"Series pass resistance",{"$f":"(Rds_ON_V5A_150-Rds_ON_V5A_min40)/190*(I4-150)+Rds_ON_V5A_150","v":0.68342594037405802},0.70860047280919103,0.70052253124085451,0.6946391507505798,0.69025024439508298,0.68692099695306441,0.68436844109702,0.68240124208904385,0.68088588576620623,0.67972671790022721,0.67885366073679487,0.67821433242386586,0.67776748417652433,0.67687193798096279,0.67639141668897385,0.67660388001117566,0.67685472482359466,0.6771419102721471,0.67746366921730361,0.67781846408831914,0.67820495096608646,0.67862195016962745,0.67906842201994555,0.67954344675358391,0.68004620778372693,0.68057597767830369,0.68113210635613874,0.68171401110381769,0.68232116809494336,0.6829531051552975,0.68360939556610356,0.68428965273616138,{"$f":"(Rds_ON_V5A_150-Rds_ON_V5A_min40)/190*(AO4-150)+Rds_ON_V5A_150","v":0.68499352560434024},0.68572069465852725,0.6864708684769314,0.6872437807136742,0.68803918746361936,0.68885686495203535,0.68969660750340434,0.69055822575087922,0.6914415450538256,0.69234640409582138,0.69327265363959012,0.69422015541878246,0.69518878114939575,0.6961784116460551,0.69718893603041843,0.69822025102071039,0.69927226029285616,0.70034487390495026,0.70143800777785825,0.73841698866227334,"Series pass resistance"]
[null,"Boost FET",null,null,null,null,null,"Power dissipated",{"$f":"(I21-I57)*Iout_V5A","v":0},0,0,0,0,0,0,0,0,0,0,0,0,0,0,0,0,0,0,0,0,0,0,0,0,0,0,0,0,0,0,0,{"$f":"(AO21-AO57)*Iout_V5A","v":0},0,0,0,0,0,0,0,0,0,0,0,0,0,0,0,0,0,0,0,"Power dissipated"]
[null,"Rds ON boost",0.02,"Recommended boost MOSFET Rds On at 25C",null,null,"V5SNR LDO","Output voltage",{"$f":"IF(I21-5<I61*Iout_V5B,I21-I61*Iout_V5B,5)","v":5},5,5,5,5,5,5,5,5,5,5,5,5,5,5,5,5,5,5,5,5,5,5,5,5,5,5,5,5,5,5,5,{"$f":"IF(AO21-5<AO61*Iout_V5B,AO21-AO61*Iout_V5B,5)","v":5},5,5,5,5,5,5,5,5,5,5,5,5,5,5,5,5,5,5,5,"Output voltage","V5 LDO"]
[null,null,1.7999999999999999E-2,"Enter Rds ON at 25C of selected boost MOSFET",null,null,null,"Series pass resistance",{"$f":"(Rds_ON_V5B_150-Rds_ON_V5B_min40)/190*(I4-150)+Rds_ON_V5B_150","v":0.68342594037405802},0.70860047280919103,0.70052253124085451,0.6946391507505798,0.69025024439508298,0.68692099695306441,0.68436844109702,0.68240124208904385,0.68088588576620623,0.67972671790022721,0.67885366073679487,0.67821433242386586,0.67776748417652433,0.67687193798096279,0.67639141668897385,0.67660388001117566,0.67685472482359466,0.6771419102721471,0.67746366921730361,0.67781846408831914,0.67820495096608646,0.67862195016962745,0.67906842201994555,0.67954344675358391,0.68004620778372693,0.68057597767830369,0.68113210635613874,0.68171401110381769,0.68232116809494336,0.6829531051552975,0.68360939556610356,0.68428965273616138,{"$f":"(Rds_ON_V5B_150-Rds_ON_V5B_min40)/190*(AO4-150)+Rds_ON_V5B_150","v":0.68499352560434024},0.68572069465852725,0.6864708684769314,0.6872437807136742,0.68803918746361936,0.68885686495203535,0.68969660750340434,0.69055822575087922,0.6914415450538256,0.69234640409582138,0.69327265363959012,0.69422015541878246,0.69518878114939575,0.6961784116460551,0.69718893603041843,0.69822025102071039,0.69927226029285616,0.70034487390495026,0.70143800777785825,0.73841698866227334,"Series pass resistance"]
[null,"Rthj-a",60,"Enter MOSFET junction to ambient thermal resistance",null,null,null,"Power dissipated",{"$f":"(I21-I60)*Iout_V5B","v":1.7499999999999984E-2},1.7499999999999984E-2,1.7499999999999984E-2,1.7499999999999984E-2,1.7499999999999984E-2,1.7499999999999984E-2,1.7499999999999984E-2,1.7499999999999984E-2,1.7499999999999984E-2,1.7499999999999984E-2,1.7499999999999984E-2,1.7499999999999984E-2,1.7499999999999984E-2,1.7499999999999984E-2,1.7499999999999984E-2,1.7499999999999984E-2,1.7499999999999984E-2,1.7499999999999984E-2,1.7499999999999984E-2,1.7499999999999984E-2,1.7499999999999984E-2,1.7499999999999984E-2,1.7499999999999984E-2,1.7499999999999984E-2,1.7499999999999984E-2,1.7499999999999984E-2,1.7499999999999984E-2,1.7499999999999984E-2,1.7499999999999984E-2,1.7499999999999984E-2,1.7499999999999984E-2,1.7499999999999984E-2,{"$f":"(AO21-AO60)*Iout_V5B","v":1.7499999999999984E-2},1.7499999999999984E-2,1.7499999999999984E-2,1.7499999999999984E-2,1.7499999999999984E-2,1.7499999999999984E-2,1.7499999999999984E-2,1.7499999999999984E-2,1.7499999999999984E-2,1.7499999999999984E-2,1.7499999999999984E-2,1.7499999999999984E-2,1.7499999999999984E-2,1.7499999999999984E-2,1.7499999999999984E-2,1.7499999999999984E-2,1.7499999999999984E-2,1.7499999999999984E-2,1.7499999999999984E-2,1.7499999999999984E-2,"Power dissipated"]
[null,"t rise boost",22,"Enter estimated boost switch rise time",null,null,"V5CAN LDO","Output voltage",{"$f":"IF(I21-5<I64*Iout_V5CAN,I21-I64*Iout_V5CAN,5)","v":5},5,5,5,5,5,5,5,5,5,5,5,5,5,5,5,5,5,5,5,5,5,5,5,5,5,5,5,5,5,5,5,{"$f":"IF(AO21-5<AO64*Iout_V5CAN,AO21-AO64*Iout_V5CAN,5)","v":5},5,5,5,5,5,5,5,5,5,5,5,5,5,5,5,5,5,5,5,"Output voltage","V5 LDO"]
[null,"t fall boost",22,"Enter estimated boost switch fall time",null,null,null,"Series pass resistance",{"$f":"(Rds_ON_V5CAN_150-Rds_ON_V5CAN_min40)/190*(I4-150)+Rds_ON_V5CAN_150","v":0.49407920037119107},0.50849913743298913,0.50387210377091673,0.50050211163306968,0.49798815219491677,0.49608116390424006,0.49461906347056861,0.493492254622931,0.49262426063504583,0.4919602908983865,0.49146020497303772,0.49109399860721875,0.4908380445544695,0.49032507694288807,0.49004983501713673,0.49017153371171968,0.49031521727035898,0.49047971669468238,0.49066401976963248,0.49086724577683144,0.4910886249212893,0.49132748148338734,0.4915832199364466,0.49185531344124211,0.49214329425798481,0.4924467457145994,0.49276529544549541,0.49309860967324171,0.4934463883508089,0.49380836101746334,0.49418428324928515,0.49457393360737406,{"$f":"(Rds_ON_V5CAN_150-Rds_ON_V5CAN_min40)/190*(AO4-150)+Rds_ON_V5CAN_150","v":0.49497711100440417},0.49539363242428286,0.49582333094101483,0.49626605399205231,0.49672166186887357,0.49719002639362447,0.49767102975565536,0.49816456348590032,0.49867052755044766,0.49918882954747573,0.49971938399408089,0.50026211169149093,0.50081693915880821,0.50138379812681622,0.50196262508455536,0.50255336087236857,0.50315595031596039,0.50377034189673264,0.50439648745427457,0.52557799612128475,"Series pass resistance"]
[null,"Max Peak current",{"$f":"IF(Topology=\"Buck\",\"-\",MAX(J22:BH22))","v":2.0147495423065558},{"$f":"IF(Topology=\"Buck\",\"\",\"Maximum peak MOSFET current\")","v":"Maximum peak MOSFET current"},null,null,null,"Power dissipated",{"$f":"(I21-I63)*Iout_V5CAN","v":6.9999999999999937E-2},6.9999999999999937E-2,6.9999999999999937E-2,6.9999999999999937E-2,6.9999999999999937E-2,6.9999999999999937E-2,6.9999999999999937E-2,6.9999999999999937E-2,6.9999999999999937E-2,6.9999999999999937E-2,6.9999999999999937E-2,6.9999999999999937E-2,6.9999999999999937E-2,6.9999999999999937E-2,6.9999999999999937E-2,6.9999999999999937E-2,6.9999999999999937E-2,6.9999999999999937E-2,6.9999999999999937E-2,6.9999999999999937E-2,6.9999999999999937E-2,6.9999999999999937E-2,6.9999999999999937E-2,6.9999999999999937E-2,6.9999999999999937E-2,6.9999999999999937E-2,6.9999999999999937E-2,6.9999999999999937E-2,6.9999999999999937E-2,6.9999999999999937E-2,6.9999999999999937E-2,6.9999999999999937E-2,{"$f":"(AO21-AO63)*Iout_V5CAN","v":6.9999999999999937E-2},6.9999999999999937E-2,6.9999999999999937E-2,6.9999999999999937E-2,6.9999999999999937E-2,6.9999999999999937E-2,6.9999999999999937E-2,6.9999999999999937E-2,6.9999999999999937E-2,6.9999999999999937E-2,6.9999999999999937E-2,6.9999999999999937E-2,6.9999999999999937E-2,6.9999999999999937E-2,6.9999999999999937E-2,6.9999999999999937E-2,6.9999999999999937E-2,6.9999999999999937E-2,6.9999999999999937E-2,6.9999999999999937E-2,"Power dissipated"]
[null,"Max RMS current",{"$f":"IF(Topology=\"Buck\",\"-\",MAX(J27:BH27))","v":1.4640114227903234},{"$f":"IF(Topology=\"Buck\",\"\",\"Maximum RMS MOSFET current\")","v":"Maximum RMS MOSFET current"},null,null,"V5P LDO","Output voltage",{"$f":"IF(I21-5<I67*Iout_V5P,I21-I67*Iout_V5P,5)","v":5},5,5,5,5,5,5,5,5,5,5,5,5,5,5,5,5,5,5,5,5,5,5,5,5,5,5,5,5,5,5,5,{"$f":"IF(AO21-5<AO67*Iout_V5P,AO21-AO67*Iout_V5P,5)","v":5},5,5,5,5,5,5,5,5,5,5,5,5,5,5,5,5,5,5,5,"Output voltage","V5 LDO"]
[null,"Maximum gate charge",6.5,"At Vgs = 5V",null,null,null,"Series pass resistance",{"$f":"(Rds_ON_V5P_150-Rds_ON_V5P_min40)/190*(I4-150)+Rds_ON_V5P_150","v":0.68342594037405802},0.70860047280919103,0.70052253124085451,0.6946391507505798,0.69025024439508298,0.68692099695306441,0.68436844109702,0.68240124208904385,0.68088588576620623,0.67972671790022721,0.67885366073679487,0.67821433242386586,0.67776748417652433,0.67687193798096279,0.67639141668897385,0.67660388001117566,0.67685472482359466,0.6771419102721471,0.67746366921730361,0.67781846408831914,0.67820495096608646,0.67862195016962745,0.67906842201994555,0.67954344675358391,0.68004620778372693,0.68057597767830369,0.68113210635613874,0.68171401110381769,0.68232116809494336,0.6829531051552975,0.68360939556610356,0.68428965273616138,{"$f":"(Rds_ON_V5P_150-Rds_ON_V5P_min40)/190*(AO4-150)+Rds_ON_V5P_150","v":0.68499352560434024},0.68572069465852725,0.6864708684769314,0.6872437807136742,0.68803918746361936,0.68885686495203535,0.68969660750340434,0.69055822575087922,0.6914415450538256,0.69234640409582138,0.69327265363959012,0.69422015541878246,0.69518878114939575,0.6961784116460551,0.69718893603041843,0.69822025102071039,0.69927226029285616,0.70034487390495026,0.70143800777785825,0.73841698866227334,"Series pass resistance"]
[null,"Max Power diss",{"$f":"IF(Topology=\"Buck\",\"-\",MAX(J82:BH82))","v":0.25666970013945994},{"$f":"IF(Topology=\"Buck\",\"\",\"Maximum MOSFET power dissipation\")","v":"Maximum MOSFET power dissipation"},null,null,null,"Power dissipated",{"$f":"(I21-I66)*Iout_V5P","v":2.6249999999999971E-2},2.6249999999999971E-2,2.6249999999999971E-2,2.6249999999999971E-2,2.6249999999999971E-2,2.6249999999999971E-2,2.6249999999999971E-2,2.6249999999999971E-2,2.6249999999999971E-2,2.6249999999999971E-2,2.6249999999999971E-2,2.6249999999999971E-2,2.6249999999999971E-2,2.6249999999999971E-2,2.6249999999999971E-2,2.6249999999999971E-2,2.6249999999999971E-2,2.6249999999999971E-2,2.6249999999999971E-2,2.6249999999999971E-2,2.6249999999999971E-2,2.6249999999999971E-2,2.6249999999999971E-2,2.6249999999999971E-2,2.6249999999999971E-2,2.6249999999999971E-2,2.6249999999999971E-2,2.6249999999999971E-2,2.6249999999999971E-2,2.6249999999999971E-2,2.6249999999999971E-2,2.6249999999999971E-2,{"$f":"(AO21-AO66)*Iout_V5P","v":2.6249999999999971E-2},2.6249999999999971E-2,2.6249999999999971E-2,2.6249999999999971E-2,2.6249999999999971E-2,2.6249999999999971E-2,2.6249999999999971E-2,2.6249999999999971E-2,2.6249999999999971E-2,2.6249999999999971E-2,2.6249999999999971E-2,2.6249999999999971E-2,2.6249999999999971E-2,2.6249999999999971E-2,2.6249999999999971E-2,2.6249999999999971E-2,2.6249999999999971E-2,2.6249999999999971E-2,2.6249999999999971E-2,2.6249999999999971E-2,"Power dissipated"]
[null,"Max Vds",{"$f":"IF(Topology=\"Buck\",\"-\",Vreg+4)","v":9.35},{"$f":"IF(Topology=\"Buck\",\"\",\"Select MOSFET with higher VDS rating\")","v":"Select MOSFET with higher VDS rating"},null,null,"Buck Diode","Tj Diode",{"$f":"I72*RTHavg_Vd+Ta","v":142.41574710893795},{"$f":"J72*RTHavg_Vd+Ta","v":142.38947686145497},142.1985467655891,141.64709532140989,140.94085775232756,140.18565169607223,139.43646035536841,138.72163276323153,138.05513869396196,137.4430490518302,136.88707781793718,136.3856903150317,135.90987184642353,135.53985531891183,131.96659945254495,133.03127343721277,134.01243916828375,134.91950593588916,135.7605266276523,136.54243266404265,137.27122192426154,137.9521102425106,138.58965442763841,139.18785284143956,139.75022815649913,140.27989586126466,140.77962128863942,141.25186734464626,141.69883465552937,142.12249549895108,142.52462261146229,{"$f":"AN72*RTHavg_Vd+Ta","v":142.90681375092365},143.2705127247936,143.61702746256435,143.94754560514673,144.26314799964996,144.56482042018223,144.85346378049431,{"$f":"AU72*RTHavg_Vd+Ta","v":145.12990305978633},145.3948951266938,145.6491356167212,145.89326499391072,146.12787390730639,146.35350793599522,146.57067180253523,146.7798331229059,146.9814257513267,147.17585277005094,147.36348916729133,147.54468424054443,147.719763757583,{"$f":"BH72*RTHavg_Vd+Ta","v":152.88414688458022},"Tj Diode","Buck Diode"]
[null,"Max TJ",{"$f":"IF(Topology=\"Buck\",\"-\",IF(ROUNDUP(MAX(J77:BH77),0)>175,\"Too High\",ROUNDUP(MAX(J77:BH77),0)))","v":141},{"$f":"IF(Topology=\"Buck\",\"\",IF(C70>175,\"Boost MOSFET temperature too high\",\"Estimated worse case boost MOSFET temperature, 175C max rated\"))","v":"Estimated worse case boost MOSFET temperature, 175C max rated"},null,null,null,"I Buck diode ON",{"$f":"I22-I23/2","v":0.83065420560747671},1.9215885634889072,1.7582320119096151,1.6193421402309234,1.5000868909476119,1.3968912208316897,1.3070503510815656,1.2284793770799738,1.1595448516517906,1.0989485682817566,1.045645553987133,0.99878541132960896,0.95767760939581437,0.92173654725847298,0.83065420560747671,0.83065420560747671,0.83065420560747683,0.83065420560747683,0.83065420560747671,0.83065420560747671,0.83065420560747671,0.83065420560747671,0.83065420560747671,0.83065420560747671,0.83065420560747671,0.8306542056074766,0.8306542056074766,0.83065420560747671,0.83065420560747671,0.83065420560747671,0.83065420560747683,0.83065420560747671,{"$f":"AO22-AO23/2","v":0.83065420560747683},0.8306542056074766,0.83065420560747671,0.8306542056074766,0.83065420560747683,0.83065420560747671,0.83065420560747671,0.8306542056074766,0.83065420560747671,0.8306542056074766,0.83065420560747671,0.8306542056074766,0.83065420560747671,0.83065420560747671,0.83065420560747683,0.83065420560747683,0.83065420560747671,0.83065420560747683,0.83065420560747671,0.83065420560747671,"I Buck diode ON"]
[null,null,null,null,null,null,null,"Vf buck diode",{"$f":"IF(Reset=1,0.45,FORECAST(I70, OFFSET(Vd_1:Vd_3,MATCH(I70,I_Vd1:I_Vd3,1)-1,0,2), OFFSET(I_Vd1:I_Vd3,MATCH(I70,I_Vd1:I_Vd3,1)-1,0,2))+(I69-25)*vd_temp_coeff/1000)","v":0.34877960814217168},{"$f":"IF(Reset=1,0.45,FORECAST(J70, OFFSET(Vd_1:Vd_3,MATCH(J70,I_Vd1:I_Vd3,1)-1,0,2), OFFSET(I_Vd1:I_Vd3,MATCH(J70,I_Vd1:I_Vd3,1)-1,0,2))+(J69-25)*vd_temp_coeff/1000)","v":0.45207559848025564},{"$f":"IF(Reset=1,0.45,FORECAST(K70, OFFSET(Vd_1:Vd_3,MATCH(K70,I_Vd1:I_Vd3,1)-1,0,2), OFFSET(I_Vd1:I_Vd3,MATCH(K70,I_Vd1:I_Vd3,1)-1,0,2))+(K69-25)*vd_temp_coeff/1000)","v":0.43760262495315838},{"$f":"IF(Reset=1,0.45,FORECAST(L70, OFFSET(Vd_1:Vd_3,MATCH(L70,I_Vd1:I_Vd3,1)-1,0,2), OFFSET(I_Vd1:I_Vd3,MATCH(L70,I_Vd1:I_Vd3,1)-1,0,2))+(L69-25)*vd_temp_coeff/1000)","v":0.42576427823509116},{"$f":"IF(Reset=1,0.45,FORECAST(M70, OFFSET(Vd_1:Vd_3,MATCH(M70,I_Vd1:I_Vd3,1)-1,0,2), OFFSET(I_Vd1:I_Vd3,MATCH(M70,I_Vd1:I_Vd3,1)-1,0,2))+(M69-25)*vd_temp_coeff/1000)","v":0.41587879088249197},{"$f":"IF(Reset=1,0.45,FORECAST(N70, OFFSET(Vd_1:Vd_3,MATCH(N70,I_Vd1:I_Vd3,1)-1,0,2), OFFSET(I_Vd1:I_Vd3,MATCH(N70,I_Vd1:I_Vd3,1)-1,0,2))+(N69-25)*vd_temp_coeff/1000)","v":0.40749742783956538},{"$f":"IF(Reset=1,0.45,FORECAST(O70, OFFSET(Vd_1:Vd_3,MATCH(O70,I_Vd1:I_Vd3,1)-1,0,2), OFFSET(I_Vd1:I_Vd3,MATCH(O70,I_Vd1:I_Vd3,1)-1,0,2))+(O69-25)*vd_temp_coeff/1000)","v":0.40031077917089875},{"$f":"IF(Reset=1,0.45,FORECAST(P70, OFFSET(Vd_1:Vd_3,MATCH(P70,I_Vd1:I_Vd3,1)-1,0,2), OFFSET(I_Vd1:I_Vd3,MATCH(P70,I_Vd1:I_Vd3,1)-1,0,2))+(P69-25)*vd_temp_coeff/1000)","v":0.39409718462131982},{"$f":"IF(Reset=1,0.45,FORECAST(Q70, OFFSET(Vd_1:Vd_3,MATCH(Q70,I_Vd1:I_Vd3,1)-1,0,2), OFFSET(I_Vd1:I_Vd3,MATCH(Q70,I_Vd1:I_Vd3,1)-1,0,2))+(Q69-25)*vd_temp_coeff/1000)","v":0.38869287021590676},{"$f":"IF(Reset=1,0.45,FORECAST(R70, OFFSET(Vd_1:Vd_3,MATCH(R70,I_Vd1:I_Vd3,1)-1,0,2), OFFSET(I_Vd1:I_Vd3,MATCH(R70,I_Vd1:I_Vd3,1)-1,0,2))+(R69-25)*vd_temp_coeff/1000)","v":0.38397371228316179},{"$f":"IF(Reset=1,0.45,FORECAST(S70, OFFSET(Vd_1:Vd_3,MATCH(S70,I_Vd1:I_Vd3,1)-1,0,2), OFFSET(I_Vd1:I_Vd3,MATCH(S70,I_Vd1:I_Vd3,1)-1,0,2))+(S69-25)*vd_temp_coeff/1000)","v":0.3798436064773173},{"$f":"IF(Reset=1,0.45,FORECAST(T70, OFFSET(Vd_1:Vd_3,MATCH(T70,I_Vd1:I_Vd3,1)-1,0,2), OFFSET(I_Vd1:I_Vd3,MATCH(T70,I_Vd1:I_Vd3,1)-1,0,2))+(T69-25)*vd_temp_coeff/1000)","v":0.37619142098151503},{"$f":"IF(Reset=1,0.45,FORECAST(U70, OFFSET(Vd_1:Vd_3,MATCH(U70,I_Vd1:I_Vd3,1)-1,0,2), OFFSET(I_Vd1:I_Vd3,MATCH(U70,I_Vd1:I_Vd3,1)-1,0,2))+(U69-25)*vd_temp_coeff/1000)","v":0.37182946691178953},{"$f":"IF(Reset=1,0.45,FORECAST(V70, OFFSET(Vd_1:Vd_3,MATCH(V70,I_Vd1:I_Vd3,1)-1,0,2), OFFSET(I_Vd1:I_Vd3,MATCH(V70,I_Vd1:I_Vd3,1)-1,0,2))+(V69-25)*vd_temp_coeff/1000)","v":0.3679605592883225},{"$f":"IF(Reset=1,0.45,FORECAST(W70, OFFSET(Vd_1:Vd_3,MATCH(W70,I_Vd1:I_Vd3,1)-1,0,2), OFFSET(I_Vd1:I_Vd3,MATCH(W70,I_Vd1:I_Vd3,1)-1,0,2))+(W69-25)*vd_temp_coeff/1000)","v":0.36131858532984329},{"$f":"IF(Reset=1,0.45,FORECAST(X70, OFFSET(Vd_1:Vd_3,MATCH(X70,I_Vd1:I_Vd3,1)-1,0,2), OFFSET(I_Vd1:I_Vd3,MATCH(X70,I_Vd1:I_Vd3,1)-1,0,2))+(X69-25)*vd_temp_coeff/1000)","v":0.36004097654824185},{"$f":"IF(Reset=1,0.45,FORECAST(Y70, OFFSET(Vd_1:Vd_3,MATCH(Y70,I_Vd1:I_Vd3,1)-1,0,2), OFFSET(I_Vd1:I_Vd3,MATCH(Y70,I_Vd1:I_Vd3,1)-1,0,2))+(Y69-25)*vd_temp_coeff/1000)","v":0.35886357767095667},{"$f":"IF(Reset=1,0.45,FORECAST(Z70, OFFSET(Vd_1:Vd_3,MATCH(Z70,I_Vd1:I_Vd3,1)-1,0,2), OFFSET(I_Vd1:I_Vd3,MATCH(Z70,I_Vd1:I_Vd3,1)-1,0,2))+(Z69-25)*vd_temp_coeff/1000)","v":0.35777509754983022},{"$f":"IF(Reset=1,0.45,FORECAST(AA70, OFFSET(Vd_1:Vd_3,MATCH(AA70,I_Vd1:I_Vd3,1)-1,0,2), OFFSET(I_Vd1:I_Vd3,MATCH(AA70,I_Vd1:I_Vd3,1)-1,0,2))+(AA69-25)*vd_temp_coeff/1000)","v":0.35676587271971449},{"$f":"IF(Reset=1,0.45,FORECAST(AB70, OFFSET(Vd_1:Vd_3,MATCH(AB70,I_Vd1:I_Vd3,1)-1,0,2), OFFSET(I_Vd1:I_Vd3,MATCH(AB70,I_Vd1:I_Vd3,1)-1,0,2))+(AB69-25)*vd_temp_coeff/1000)","v":0.35582758547604598},{"$f":"IF(Reset=1,0.45,FORECAST(AC70, OFFSET(Vd_1:Vd_3,MATCH(AC70,I_Vd1:I_Vd3,1)-1,0,2), OFFSET(I_Vd1:I_Vd3,MATCH(AC70,I_Vd1:I_Vd3,1)-1,0,2))+(AC69-25)*vd_temp_coeff/1000)","v":0.35495303836378334},{"$f":"IF(Reset=1,0.45,FORECAST(AD70, OFFSET(Vd_1:Vd_3,MATCH(AD70,I_Vd1:I_Vd3,1)-1,0,2), OFFSET(I_Vd1:I_Vd3,MATCH(AD70,I_Vd1:I_Vd3,1)-1,0,2))+(AD69-25)*vd_temp_coeff/1000)","v":0.35413597238188449},{"$f":"IF(Reset=1,0.45,FORECAST(AE70, OFFSET(Vd_1:Vd_3,MATCH(AE70,I_Vd1:I_Vd3,1)-1,0,2), OFFSET(I_Vd1:I_Vd3,MATCH(AE70,I_Vd1:I_Vd3,1)-1,0,2))+(AE69-25)*vd_temp_coeff/1000)","v":0.35337091935973108},{"$f":"IF(Reset=1,0.45,FORECAST(AF70, OFFSET(Vd_1:Vd_3,MATCH(AF70,I_Vd1:I_Vd3,1)-1,0,2), OFFSET(I_Vd1:I_Vd3,MATCH(AF70,I_Vd1:I_Vd3,1)-1,0,2))+(AF69-25)*vd_temp_coeff/1000)","v":0.35265308126316974},{"$f":"IF(Reset=1,0.45,FORECAST(AG70, OFFSET(Vd_1:Vd_3,MATCH(AG70,I_Vd1:I_Vd3,1)-1,0,2), OFFSET(I_Vd1:I_Vd3,MATCH(AG70,I_Vd1:I_Vd3,1)-1,0,2))+(AG69-25)*vd_temp_coeff/1000)","v":0.35197823088509828},{"$f":"IF(Reset=1,0.45,FORECAST(AH70, OFFSET(Vd_1:Vd_3,MATCH(AH70,I_Vd1:I_Vd3,1)-1,0,2), OFFSET(I_Vd1:I_Vd3,MATCH(AH70,I_Vd1:I_Vd3,1)-1,0,2))+(AH69-25)*vd_temp_coeff/1000)","v":0.35134262963937957},{"$f":"IF(Reset=1,0.45,FORECAST(AI70, OFFSET(Vd_1:Vd_3,MATCH(AI70,I_Vd1:I_Vd3,1)-1,0,2), OFFSET(I_Vd1:I_Vd3,MATCH(AI70,I_Vd1:I_Vd3,1)-1,0,2))+(AI69-25)*vd_temp_coeff/1000)","v":0.35074295912652986},{"$f":"IF(Reset=1,0.45,FORECAST(AJ70, OFFSET(Vd_1:Vd_3,MATCH(AJ70,I_Vd1:I_Vd3,1)-1,0,2), OFFSET(I_Vd1:I_Vd3,MATCH(AJ70,I_Vd1:I_Vd3,1)-1,0,2))+(AJ69-25)*vd_temp_coeff/1000)","v":0.35017626385932171},{"$f":"IF(Reset=1,0.45,FORECAST(AK70, OFFSET(Vd_1:Vd_3,MATCH(AK70,I_Vd1:I_Vd3,1)-1,0,2), OFFSET(I_Vd1:I_Vd3,MATCH(AK70,I_Vd1:I_Vd3,1)-1,0,2))+(AK69-25)*vd_temp_coeff/1000)","v":0.34963990308626197},{"$f":"IF(Reset=1,0.45,FORECAST(AL70, OFFSET(Vd_1:Vd_3,MATCH(AL70,I_Vd1:I_Vd3,1)-1,0,2), OFFSET(I_Vd1:I_Vd3,MATCH(AL70,I_Vd1:I_Vd3,1)-1,0,2))+(AL69-25)*vd_temp_coeff/1000)","v":0.34913151007415588},{"$f":"IF(Reset=1,0.45,FORECAST(AM70, OFFSET(Vd_1:Vd_3,MATCH(AM70,I_Vd1:I_Vd3,1)-1,0,2), OFFSET(I_Vd1:I_Vd3,MATCH(AM70,I_Vd1:I_Vd3,1)-1,0,2))+(AM69-25)*vd_temp_coeff/1000)","v":0.34864895753914249},{"$f":"IF(Reset=1,0.45,FORECAST(AN70, OFFSET(Vd_1:Vd_3,MATCH(AN70,I_Vd1:I_Vd3,1)-1,0,2), OFFSET(I_Vd1:I_Vd3,MATCH(AN70,I_Vd1:I_Vd3,1)-1,0,2))+(AN69-25)*vd_temp_coeff/1000)","v":0.34819032817178885},{"$f":"IF(Reset=1,0.45,FORECAST(AO70, OFFSET(Vd_1:Vd_3,MATCH(AO70,I_Vd1:I_Vd3,1)-1,0,2), OFFSET(I_Vd1:I_Vd3,MATCH(AO70,I_Vd1:I_Vd3,1)-1,0,2))+(AO69-25)*vd_temp_coeff/1000)","v":0.34775388940314489},{"$f":"IF(Reset=1,0.45,FORECAST(AP70, OFFSET(Vd_1:Vd_3,MATCH(AP70,I_Vd1:I_Vd3,1)-1,0,2), OFFSET(I_Vd1:I_Vd3,MATCH(AP70,I_Vd1:I_Vd3,1)-1,0,2))+(AP69-25)*vd_temp_coeff/1000)","v":0.34733807171782},{"$f":"IF(Reset=1,0.45,FORECAST(AQ70, OFFSET(Vd_1:Vd_3,MATCH(AQ70,I_Vd1:I_Vd3,1)-1,0,2), OFFSET(I_Vd1:I_Vd3,MATCH(AQ70,I_Vd1:I_Vd3,1)-1,0,2))+(AQ69-25)*vd_temp_coeff/1000)","v":0.34694144994672116},{"$f":"IF(Reset=1,0.45,FORECAST(AR70, OFFSET(Vd_1:Vd_3,MATCH(AR70,I_Vd1:I_Vd3,1)-1,0,2), OFFSET(I_Vd1:I_Vd3,MATCH(AR70,I_Vd1:I_Vd3,1)-1,0,2))+(AR69-25)*vd_temp_coeff/1000)","v":0.34656272707331726},{"$f":"IF(Reset=1,0.45,FORECAST(AS70, OFFSET(Vd_1:Vd_3,MATCH(AS70,I_Vd1:I_Vd3,1)-1,0,2), OFFSET(I_Vd1:I_Vd3,MATCH(AS70,I_Vd1:I_Vd3,1)-1,0,2))+(AS69-25)*vd_temp_coeff/1000)","v":0.34620072016867853},{"$f":"IF(Reset=1,0.45,FORECAST(AT70, OFFSET(Vd_1:Vd_3,MATCH(AT70,I_Vd1:I_Vd3,1)-1,0,2), OFFSET(I_Vd1:I_Vd3,MATCH(AT70,I_Vd1:I_Vd3,1)-1,0,2))+(AT69-25)*vd_temp_coeff/1000)","v":0.345854348136304},{"$f":"IF(Reset=1,0.45,FORECAST(AU70, OFFSET(Vd_1:Vd_3,MATCH(AU70,I_Vd1:I_Vd3,1)-1,0,2), OFFSET(I_Vd1:I_Vd3,MATCH(AU70,I_Vd1:I_Vd3,1)-1,0,2))+(AU69-25)*vd_temp_coeff/1000)","v":0.34552262100115361},{"$f":"IF(Reset=1,0.45,FORECAST(AV70, OFFSET(Vd_1:Vd_3,MATCH(AV70,I_Vd1:I_Vd3,1)-1,0,2), OFFSET(I_Vd1:I_Vd3,MATCH(AV70,I_Vd1:I_Vd3,1)-1,0,2))+(AV69-25)*vd_temp_coeff/1000)","v":0.34520463052086464},{"$f":"IF(Reset=1,0.45,FORECAST(AW70, OFFSET(Vd_1:Vd_3,MATCH(AW70,I_Vd1:I_Vd3,1)-1,0,2), OFFSET(I_Vd1:I_Vd3,MATCH(AW70,I_Vd1:I_Vd3,1)-1,0,2))+(AW69-25)*vd_temp_coeff/1000)","v":0.34489954193283179},{"$f":"IF(Reset=1,0.45,FORECAST(AX70, OFFSET(Vd_1:Vd_3,MATCH(AX70,I_Vd1:I_Vd3,1)-1,0,2), OFFSET(I_Vd1:I_Vd3,MATCH(AX70,I_Vd1:I_Vd3,1)-1,0,2))+(AX69-25)*vd_temp_coeff/1000)","v":0.34460658668020439},{"$f":"IF(Reset=1,0.45,FORECAST(AY70, OFFSET(Vd_1:Vd_3,MATCH(AY70,I_Vd1:I_Vd3,1)-1,0,2), OFFSET(I_Vd1:I_Vd3,MATCH(AY70,I_Vd1:I_Vd3,1)-1,0,2))+(AY69-25)*vd_temp_coeff/1000)","v":0.34432505598412955},{"$f":"IF(Reset=1,0.45,FORECAST(AZ70, OFFSET(Vd_1:Vd_3,MATCH(AZ70,I_Vd1:I_Vd3,1)-1,0,2), OFFSET(I_Vd1:I_Vd3,MATCH(AZ70,I_Vd1:I_Vd3,1)-1,0,2))+(AZ69-25)*vd_temp_coeff/1000)","v":0.34405429514970298},{"$f":"IF(Reset=1,0.45,FORECAST(BA70, OFFSET(Vd_1:Vd_3,MATCH(BA70,I_Vd1:I_Vd3,1)-1,0,2), OFFSET(I_Vd1:I_Vd3,MATCH(BA70,I_Vd1:I_Vd3,1)-1,0,2))+(BA69-25)*vd_temp_coeff/1000)","v":0.34379369850985492},{"$f":"IF(Reset=1,0.45,FORECAST(BB70, OFFSET(Vd_1:Vd_3,MATCH(BB70,I_Vd1:I_Vd3,1)-1,0,2), OFFSET(I_Vd1:I_Vd3,MATCH(BB70,I_Vd1:I_Vd3,1)-1,0,2))+(BB69-25)*vd_temp_coeff/1000)","v":0.34354270492541011},{"$f":"IF(Reset=1,0.45,FORECAST(BC70, OFFSET(Vd_1:Vd_3,MATCH(BC70,I_Vd1:I_Vd3,1)-1,0,2), OFFSET(I_Vd1:I_Vd3,MATCH(BC70,I_Vd1:I_Vd3,1)-1,0,2))+(BC69-25)*vd_temp_coeff/1000)","v":0.34330079377130518},{"$f":"IF(Reset=1,0.45,FORECAST(BD70, OFFSET(Vd_1:Vd_3,MATCH(BD70,I_Vd1:I_Vd3,1)-1,0,2), OFFSET(I_Vd1:I_Vd3,MATCH(BD70,I_Vd1:I_Vd3,1)-1,0,2))+(BD69-25)*vd_temp_coeff/1000)","v":0.34306748134883608},{"$f":"IF(Reset=1,0.45,FORECAST(BE70, OFFSET(Vd_1:Vd_3,MATCH(BE70,I_Vd1:I_Vd3,1)-1,0,2), OFFSET(I_Vd1:I_Vd3,MATCH(BE70,I_Vd1:I_Vd3,1)-1,0,2))+(BE69-25)*vd_temp_coeff/1000)","v":0.34284231767214757},{"$f":"IF(Reset=1,0.45,FORECAST(BF70, OFFSET(Vd_1:Vd_3,MATCH(BF70,I_Vd1:I_Vd3,1)-1,0,2), OFFSET(I_Vd1:I_Vd3,MATCH(BF70,I_Vd1:I_Vd3,1)-1,0,2))+(BF69-25)*vd_temp_coeff/1000)","v":0.34262488358424392},{"$f":"IF(Reset=1,0.45,FORECAST(BG70, OFFSET(Vd_1:Vd_3,MATCH(BG70,I_Vd1:I_Vd3,1)-1,0,2), OFFSET(I_Vd1:I_Vd3,MATCH(BG70,I_Vd1:I_Vd3,1)-1,0,2))+(BG69-25)*vd_temp_coeff/1000)","v":0.34241478816379761},{"$f":"IF(Reset=1,0.45,FORECAST(BH70, OFFSET(Vd_1:Vd_3,MATCH(BH70,I_Vd1:I_Vd3,1)-1,0,2), OFFSET(I_Vd1:I_Vd3,MATCH(BH70,I_Vd1:I_Vd3,1)-1,0,2))+(BH69-25)*vd_temp_coeff/1000)","v":0.33621752841140096},"Vf buck diode"]
[null,"Buck Diode (based on SS3P5)",null,null,null,null,null,"Pdiss buck diode",{"$f":"I71*I26","v":0.1451312259078163},0.14491230717879131,0.14332122304657591,0.13872579434508248,0.13284048126939627,0.12654709746726861,0.12030383629473673,0.11434693969359598,0.10879282244968309,0.10369207543191841,9.9058981816143254E-2,9.4880752625264089E-2,9.0915598720195986E-2,8.7832127657598694E-2,5.8054995437874526E-2,6.6927278643439822E-2,7.5103659735697867E-2,8.2662549465742904E-2,8.9671055230435906E-2,9.6186938867022106E-2,0.10226018270217957,0.10793425202092173,0.11324712023032009,0.11823210701199628,0.12291856797082604,0.12733246551053884,0.13149684407199505,0.13543222787205214,0.13915695546274479,0.14268746249125899,0.14603852176218582,0.14922344792436376,{"$f":"AO71*AO26","v":0.15225427270661326},0.15514189552136945,0.15789621337622287,0.16052623333041643,0.16304017016818528,0.16544553150411925,0.16774919216488601,0.16995745938911491,0.17207613013934339,0.17411054161592268,0.17606561589421996,0.17794589946662695,0.1797555983544602,0.18149860935754922,0.18317854792772234,0.18479877308375783,0.1863624097274279,0.18787236867120369,0.18933136464652497,0.23236789070483518,"Pdiss buck diode"]
[null,"Max Peak current",{"$f":"IF(Topology=\"Buck\",MAX(J102:BH102),MAX(J22:BH22))","v":2.0147495423065558},"Maximum peak diode current",null,null,"Boost Diode","Tj Boost Diode",{"$f":"I76*RTHavg_Vd_boost+Ta","v":164.38380001168841},{"$f":"J76*RTHavg_Vd_boost+Ta","v":170.41078713372178},169.14022703738004,168.02539507168262,167.05877490126903,166.21169907483369,165.46246588942418,164.79434124219421,164.19421215538247,163.65165639533359,163.15828530563107,162.70727343346934,162.29308102203555,161.82766386980975,162.84943871911241,163.13807533788227,163.37926077565146,163.58053041725395,163.74809641326431,163.88710571066693,164.00184287638706,164.09589049742181,164.17225677883164,164.23347762403273,164.28169874591669,164.31874206051498,164.34615964051659,164.36527776949657,164.37723307786933,164.38300231354063,{"$f":"AM76*RTHavg_Vd_boost+Ta","v":164.38342697112859},164.3792337491937,164.37105160717118,164.35942603920728,164.34483106080216,164.32767930845623,164.30833057665521,164.28709905612183,{"$f":"AU76*RTHavg_Vd_boost+Ta","v":164.26425948895081},164.24005241744388,164.21468867217331,164.18835321947103,164.16120846795638,164.13339711692515,164.10504461567967,164.07626129159286,164.04714419539735,164.01777870450246,163.98823991876486,163.95859387783702,163.92889862479362,{"$f":"BH76*RTHavg_Vd_boost+Ta","v":164.64244088885289},"Tj Boost Diode","Boost Diode"]
[null,"Max Average current",{"$f":"IF(Topology=\"Buck\",MAX(J106:BH106),MAX(J26:BH26))","v":0.69112366568975026},"Maximum average diode current",null,null,null,"I boost diode ON",{"$f":"IF(I17=0,I28,IF(I$12>I$14,I22,I22-I23/2))","v":0.91163165358932174},2.0147495423065558,1.8551795788844998,1.7185228172260774,1.6000339450848877,1.496198889326172,1.4043574423678096,1.3224583279864699,1.2488941496132671,1.1823873436830823,1.1219096237313966,1.0666243217167866,1.0158523709729561,0.96910094590668883,0.88127613954597184,0.88700750373510984,0.89178911007356176,0.89577414817296452,0.89908826581115986,0.90183511371352965,0.90410065440041065,0.90595653632212125,0.90746275512281505,0.90866976689973056,0.90962017703574594,0.91035009798767663,0.9108902471382081,0.91126683925250695,0.91150231566251549,0.9116159429245595,0.91162430656467841,0.91154172006654577,{"$f":"IF(AO17=0,AO28,IF(AO$12>AO$14,AO22,AO22-AO23/2))","v":0.91138056505038345},0.91115157533051416,0.91086407499681932,0.91052617867209407,0.91014496052624438,0.90972659738369732,0.90927649026970048,0.9087993679488735,0.90829937537292482,0.90778014944098229,0.90724488406006842,0.90669638615498538,0.90613712400075874,0.90556926902454005,0.90499473203786518,0.90441519470670695,0.90383213693975151,0.90324686076987515,0.90266051121598123,0.91672175495121577,"I boost diode ON"]
[null,"max Power diss",{"$f":"MAX(J72:BH72)","v":0.23236789070483518},"Maximum diode power dissipation",null,null,null,"Vf boost diode",{"$f":"IF(Reset=1,0.45,FORECAST(I74, OFFSET(Vd_1_boost:Vd_3_boost,MATCH(I74,I_Vd1_boost:I_Vd3_boost,1)-1,0,2), OFFSET(I_Vd1_boost:I_Vd3_boost,MATCH(I74,I_Vd1_boost:I_Vd3_boost,1)-1,0,2))+(I73-25)*vd_boost_temp_coeff/1000)","v":0.3600119984190302},{"$f":"IF(Reset=1,0.45,FORECAST(J74, OFFSET(Vd_1_boost:Vd_3_boost,MATCH(J74,I_Vd1_boost:I_Vd3_boost,1)-1,0,2), OFFSET(I_Vd1_boost:I_Vd3_boost,MATCH(J74,I_Vd1_boost:I_Vd3_boost,1)-1,0,2))+(J73-25)*vd_boost_temp_coeff/1000)","v":0.4555725156867152},{"$f":"IF(Reset=1,0.45,FORECAST(K74, OFFSET(Vd_1_boost:Vd_3_boost,MATCH(K74,I_Vd1_boost:I_Vd3_boost,1)-1,0,2), OFFSET(I_Vd1_boost:I_Vd3_boost,MATCH(K74,I_Vd1_boost:I_Vd3_boost,1)-1,0,2))+(K73-25)*vd_boost_temp_coeff/1000)","v":0.4428259350622249},{"$f":"IF(Reset=1,0.45,FORECAST(L74, OFFSET(Vd_1_boost:Vd_3_boost,MATCH(L74,I_Vd1_boost:I_Vd3_boost,1)-1,0,2), OFFSET(I_Vd1_boost:I_Vd3_boost,MATCH(L74,I_Vd1_boost:I_Vd3_boost,1)-1,0,2))+(L73-25)*vd_boost_temp_coeff/1000)","v":0.4316416584786642},{"$f":"IF(Reset=1,0.45,FORECAST(M74, OFFSET(Vd_1_boost:Vd_3_boost,MATCH(M74,I_Vd1_boost:I_Vd3_boost,1)-1,0,2), OFFSET(I_Vd1_boost:I_Vd3_boost,MATCH(M74,I_Vd1_boost:I_Vd3_boost,1)-1,0,2))+(M73-25)*vd_boost_temp_coeff/1000)","v":0.42194428015637075},{"$f":"IF(Reset=1,0.45,FORECAST(N74, OFFSET(Vd_1_boost:Vd_3_boost,MATCH(N74,I_Vd1_boost:I_Vd3_boost,1)-1,0,2), OFFSET(I_Vd1_boost:I_Vd3_boost,MATCH(N74,I_Vd1_boost:I_Vd3_boost,1)-1,0,2))+(N73-25)*vd_boost_temp_coeff/1000)","v":0.41344620096452178},{"$f":"IF(Reset=1,0.45,FORECAST(O74, OFFSET(Vd_1_boost:Vd_3_boost,MATCH(O74,I_Vd1_boost:I_Vd3_boost,1)-1,0,2), OFFSET(I_Vd1_boost:I_Vd3_boost,MATCH(O74,I_Vd1_boost:I_Vd3_boost,1)-1,0,2))+(O73-25)*vd_boost_temp_coeff/1000)","v":0.40592970392367861},{"$f":"IF(Reset=1,0.45,FORECAST(P74, OFFSET(Vd_1_boost:Vd_3_boost,MATCH(P74,I_Vd1_boost:I_Vd3_boost,1)-1,0,2), OFFSET(I_Vd1_boost:I_Vd3_boost,MATCH(P74,I_Vd1_boost:I_Vd3_boost,1)-1,0,2))+(P73-25)*vd_boost_temp_coeff/1000)","v":0.39922690827658808},{"$f":"IF(Reset=1,0.45,FORECAST(Q74, OFFSET(Vd_1_boost:Vd_3_boost,MATCH(Q74,I_Vd1_boost:I_Vd3_boost,1)-1,0,2), OFFSET(I_Vd1_boost:I_Vd3_boost,MATCH(Q74,I_Vd1_boost:I_Vd3_boost,1)-1,0,2))+(Q73-25)*vd_boost_temp_coeff/1000)","v":0.39320626130981146},{"$f":"IF(Reset=1,0.45,FORECAST(R74, OFFSET(Vd_1_boost:Vd_3_boost,MATCH(R74,I_Vd1_boost:I_Vd3_boost,1)-1,0,2), OFFSET(I_Vd1_boost:I_Vd3_boost,MATCH(R74,I_Vd1_boost:I_Vd3_boost,1)-1,0,2))+(R73-25)*vd_boost_temp_coeff/1000)","v":0.38776320453614377},{"$f":"IF(Reset=1,0.45,FORECAST(S74, OFFSET(Vd_1_boost:Vd_3_boost,MATCH(S74,I_Vd1_boost:I_Vd3_boost,1)-1,0,2), OFFSET(I_Vd1_boost:I_Vd3_boost,MATCH(S74,I_Vd1_boost:I_Vd3_boost,1)-1,0,2))+(S73-25)*vd_boost_temp_coeff/1000)","v":0.38281358083019462},{"$f":"IF(Reset=1,0.45,FORECAST(T74, OFFSET(Vd_1_boost:Vd_3_boost,MATCH(T74,I_Vd1_boost:I_Vd3_boost,1)-1,0,2), OFFSET(I_Vd1_boost:I_Vd3_boost,MATCH(T74,I_Vd1_boost:I_Vd3_boost,1)-1,0,2))+(T73-25)*vd_boost_temp_coeff/1000)","v":0.37828891552104138},{"$f":"IF(Reset=1,0.45,FORECAST(U74, OFFSET(Vd_1_boost:Vd_3_boost,MATCH(U74,I_Vd1_boost:I_Vd3_boost,1)-1,0,2), OFFSET(I_Vd1_boost:I_Vd3_boost,MATCH(U74,I_Vd1_boost:I_Vd3_boost,1)-1,0,2))+(U73-25)*vd_boost_temp_coeff/1000)","v":0.37413363236553043},{"$f":"IF(Reset=1,0.45,FORECAST(V74, OFFSET(Vd_1_boost:Vd_3_boost,MATCH(V74,I_Vd1_boost:I_Vd3_boost,1)-1,0,2), OFFSET(I_Vd1_boost:I_Vd3_boost,MATCH(V74,I_Vd1_boost:I_Vd3_boost,1)-1,0,2))+(V73-25)*vd_boost_temp_coeff/1000)","v":0.36946444963899289},{"$f":"IF(Reset=1,0.45,FORECAST(W74, OFFSET(Vd_1_boost:Vd_3_boost,MATCH(W74,I_Vd1_boost:I_Vd3_boost,1)-1,0,2), OFFSET(I_Vd1_boost:I_Vd3_boost,MATCH(W74,I_Vd1_boost:I_Vd3_boost,1)-1,0,2))+(W73-25)*vd_boost_temp_coeff/1000)","v":0.3579036980264042},{"$f":"IF(Reset=1,0.45,FORECAST(X74, OFFSET(Vd_1_boost:Vd_3_boost,MATCH(X74,I_Vd1_boost:I_Vd3_boost,1)-1,0,2), OFFSET(I_Vd1_boost:I_Vd3_boost,MATCH(X74,I_Vd1_boost:I_Vd3_boost,1)-1,0,2))+(X73-25)*vd_boost_temp_coeff/1000)","v":0.35830282511033096},{"$f":"IF(Reset=1,0.45,FORECAST(Y74, OFFSET(Vd_1_boost:Vd_3_boost,MATCH(Y74,I_Vd1_boost:I_Vd3_boost,1)-1,0,2), OFFSET(I_Vd1_boost:I_Vd3_boost,MATCH(Y74,I_Vd1_boost:I_Vd3_boost,1)-1,0,2))+(Y73-25)*vd_boost_temp_coeff/1000)","v":0.35863543243317597},{"$f":"IF(Reset=1,0.45,FORECAST(Z74, OFFSET(Vd_1_boost:Vd_3_boost,MATCH(Z74,I_Vd1_boost:I_Vd3_boost,1)-1,0,2), OFFSET(I_Vd1_boost:I_Vd3_boost,MATCH(Z74,I_Vd1_boost:I_Vd3_boost,1)-1,0,2))+(Z73-25)*vd_boost_temp_coeff/1000)","v":0.35891236736350185},{"$f":"IF(Reset=1,0.45,FORECAST(AA74, OFFSET(Vd_1_boost:Vd_3_boost,MATCH(AA74,I_Vd1_boost:I_Vd3_boost,1)-1,0,2), OFFSET(I_Vd1_boost:I_Vd3_boost,MATCH(AA74,I_Vd1_boost:I_Vd3_boost,1)-1,0,2))+(AA73-25)*vd_boost_temp_coeff/1000)","v":0.3591424954840749},{"$f":"IF(Reset=1,0.45,FORECAST(AB74, OFFSET(Vd_1_boost:Vd_3_boost,MATCH(AB74,I_Vd1_boost:I_Vd3_boost,1)-1,0,2), OFFSET(I_Vd1_boost:I_Vd3_boost,MATCH(AB74,I_Vd1_boost:I_Vd3_boost,1)-1,0,2))+(AB73-25)*vd_boost_temp_coeff/1000)","v":0.35933310793495665},{"$f":"IF(Reset=1,0.45,FORECAST(AC74, OFFSET(Vd_1_boost:Vd_3_boost,MATCH(AC74,I_Vd1_boost:I_Vd3_boost,1)-1,0,2), OFFSET(I_Vd1_boost:I_Vd3_boost,MATCH(AC74,I_Vd1_boost:I_Vd3_boost,1)-1,0,2))+(AC73-25)*vd_boost_temp_coeff/1000)","v":0.35949023565166222},{"$f":"IF(Reset=1,0.45,FORECAST(AD74, OFFSET(Vd_1_boost:Vd_3_boost,MATCH(AD74,I_Vd1_boost:I_Vd3_boost,1)-1,0,2), OFFSET(I_Vd1_boost:I_Vd3_boost,MATCH(AD74,I_Vd1_boost:I_Vd3_boost,1)-1,0,2))+(AD73-25)*vd_boost_temp_coeff/1000)","v":0.3596188938612328},{"$f":"IF(Reset=1,0.45,FORECAST(AE74, OFFSET(Vd_1_boost:Vd_3_boost,MATCH(AE74,I_Vd1_boost:I_Vd3_boost,1)-1,0,2), OFFSET(I_Vd1_boost:I_Vd3_boost,MATCH(AE74,I_Vd1_boost:I_Vd3_boost,1)-1,0,2))+(AE73-25)*vd_boost_temp_coeff/1000)","v":0.35972327383590619},{"$f":"IF(Reset=1,0.45,FORECAST(AF74, OFFSET(Vd_1_boost:Vd_3_boost,MATCH(AF74,I_Vd1_boost:I_Vd3_boost,1)-1,0,2), OFFSET(I_Vd1_boost:I_Vd3_boost,MATCH(AF74,I_Vd1_boost:I_Vd3_boost,1)-1,0,2))+(AF73-25)*vd_boost_temp_coeff/1000)","v":0.35980689440393498},{"$f":"IF(Reset=1,0.45,FORECAST(AG74, OFFSET(Vd_1_boost:Vd_3_boost,MATCH(AG74,I_Vd1_boost:I_Vd3_boost,1)-1,0,2), OFFSET(I_Vd1_boost:I_Vd3_boost,MATCH(AG74,I_Vd1_boost:I_Vd3_boost,1)-1,0,2))+(AG73-25)*vd_boost_temp_coeff/1000)","v":0.35987272249837288},{"$f":"IF(Reset=1,0.45,FORECAST(AH74, OFFSET(Vd_1_boost:Vd_3_boost,MATCH(AH74,I_Vd1_boost:I_Vd3_boost,1)-1,0,2), OFFSET(I_Vd1_boost:I_Vd3_boost,MATCH(AH74,I_Vd1_boost:I_Vd3_boost,1)-1,0,2))+(AH73-25)*vd_boost_temp_coeff/1000)","v":0.35992326969800625},{"$f":"IF(Reset=1,0.45,FORECAST(AI74, OFFSET(Vd_1_boost:Vd_3_boost,MATCH(AI74,I_Vd1_boost:I_Vd3_boost,1)-1,0,2), OFFSET(I_Vd1_boost:I_Vd3_boost,MATCH(AI74,I_Vd1_boost:I_Vd3_boost,1)-1,0,2))+(AI73-25)*vd_boost_temp_coeff/1000)","v":0.35996067001606835},{"$f":"IF(Reset=1,0.45,FORECAST(AJ74, OFFSET(Vd_1_boost:Vd_3_boost,MATCH(AJ74,I_Vd1_boost:I_Vd3_boost,1)-1,0,2), OFFSET(I_Vd1_boost:I_Vd3_boost,MATCH(AJ74,I_Vd1_boost:I_Vd3_boost,1)-1,0,2))+(AJ73-25)*vd_boost_temp_coeff/1000)","v":0.35998674294080424},{"$f":"IF(Reset=1,0.45,FORECAST(AK74, OFFSET(Vd_1_boost:Vd_3_boost,MATCH(AK74,I_Vd1_boost:I_Vd3_boost,1)-1,0,2), OFFSET(I_Vd1_boost:I_Vd3_boost,MATCH(AK74,I_Vd1_boost:I_Vd3_boost,1)-1,0,2))+(AK73-25)*vd_boost_temp_coeff/1000)","v":0.36000304480163259},{"$f":"IF(Reset=1,0.45,FORECAST(AL74, OFFSET(Vd_1_boost:Vd_3_boost,MATCH(AL74,I_Vd1_boost:I_Vd3_boost,1)-1,0,2), OFFSET(I_Vd1_boost:I_Vd3_boost,MATCH(AL74,I_Vd1_boost:I_Vd3_boost,1)-1,0,2))+(AL73-25)*vd_boost_temp_coeff/1000)","v":0.36001091083740655},{"$f":"IF(Reset=1,0.45,FORECAST(AM74, OFFSET(Vd_1_boost:Vd_3_boost,MATCH(AM74,I_Vd1_boost:I_Vd3_boost,1)-1,0,2), OFFSET(I_Vd1_boost:I_Vd3_boost,MATCH(AM74,I_Vd1_boost:I_Vd3_boost,1)-1,0,2))+(AM73-25)*vd_boost_temp_coeff/1000)","v":0.36001148981663283},{"$f":"IF(Reset=1,0.45,FORECAST(AN74, OFFSET(Vd_1_boost:Vd_3_boost,MATCH(AN74,I_Vd1_boost:I_Vd3_boost,1)-1,0,2), OFFSET(I_Vd1_boost:I_Vd3_boost,MATCH(AN74,I_Vd1_boost:I_Vd3_boost,1)-1,0,2))+(AN73-25)*vd_boost_temp_coeff/1000)","v":0.3600057726587918},{"$f":"IF(Reset=1,0.45,FORECAST(AO74, OFFSET(Vd_1_boost:Vd_3_boost,MATCH(AO74,I_Vd1_boost:I_Vd3_boost,1)-1,0,2), OFFSET(I_Vd1_boost:I_Vd3_boost,MATCH(AO74,I_Vd1_boost:I_Vd3_boost,1)-1,0,2))+(AO73-25)*vd_boost_temp_coeff/1000)","v":0.35999461619887485},{"$f":"IF(Reset=1,0.45,FORECAST(AP74, OFFSET(Vd_1_boost:Vd_3_boost,MATCH(AP74,I_Vd1_boost:I_Vd3_boost,1)-1,0,2), OFFSET(I_Vd1_boost:I_Vd3_boost,MATCH(AP74,I_Vd1_boost:I_Vd3_boost,1)-1,0,2))+(AP73-25)*vd_boost_temp_coeff/1000)","v":0.35997876300045439},{"$f":"IF(Reset=1,0.45,FORECAST(AQ74, OFFSET(Vd_1_boost:Vd_3_boost,MATCH(AQ74,I_Vd1_boost:I_Vd3_boost,1)-1,0,2), OFFSET(I_Vd1_boost:I_Vd3_boost,MATCH(AQ74,I_Vd1_boost:I_Vd3_boost,1)-1,0,2))+(AQ73-25)*vd_boost_temp_coeff/1000)","v":0.3599588579388161},{"$f":"IF(Reset=1,0.45,FORECAST(AR74, OFFSET(Vd_1_boost:Vd_3_boost,MATCH(AR74,I_Vd1_boost:I_Vd3_boost,1)-1,0,2), OFFSET(I_Vd1_boost:I_Vd3_boost,MATCH(AR74,I_Vd1_boost:I_Vd3_boost,1)-1,0,2))+(AR73-25)*vd_boost_temp_coeff/1000)","v":0.35993546213219507},{"$f":"IF(Reset=1,0.45,FORECAST(AS74, OFFSET(Vd_1_boost:Vd_3_boost,MATCH(AS74,I_Vd1_boost:I_Vd3_boost,1)-1,0,2), OFFSET(I_Vd1_boost:I_Vd3_boost,MATCH(AS74,I_Vd1_boost:I_Vd3_boost,1)-1,0,2))+(AS73-25)*vd_boost_temp_coeff/1000)","v":0.35990906468649414},{"$f":"IF(Reset=1,0.45,FORECAST(AT74, OFFSET(Vd_1_boost:Vd_3_boost,MATCH(AT74,I_Vd1_boost:I_Vd3_boost,1)-1,0,2), OFFSET(I_Vd1_boost:I_Vd3_boost,MATCH(AT74,I_Vd1_boost:I_Vd3_boost,1)-1,0,2))+(AT73-25)*vd_boost_temp_coeff/1000)","v":0.35988009262992182},{"$f":"IF(Reset=1,0.45,FORECAST(AU74, OFFSET(Vd_1_boost:Vd_3_boost,MATCH(AU74,I_Vd1_boost:I_Vd3_boost,1)-1,0,2), OFFSET(I_Vd1_boost:I_Vd3_boost,MATCH(AU74,I_Vd1_boost:I_Vd3_boost,1)-1,0,2))+(AU73-25)*vd_boost_temp_coeff/1000)","v":0.35984891934341323},{"$f":"IF(Reset=1,0.45,FORECAST(AV74, OFFSET(Vd_1_boost:Vd_3_boost,MATCH(AV74,I_Vd1_boost:I_Vd3_boost,1)-1,0,2), OFFSET(I_Vd1_boost:I_Vd3_boost,MATCH(AV74,I_Vd1_boost:I_Vd3_boost,1)-1,0,2))+(AV73-25)*vd_boost_temp_coeff/1000)","v":0.35981587173642093},{"$f":"IF(Reset=1,0.45,FORECAST(AW74, OFFSET(Vd_1_boost:Vd_3_boost,MATCH(AW74,I_Vd1_boost:I_Vd3_boost,1)-1,0,2), OFFSET(I_Vd1_boost:I_Vd3_boost,MATCH(AW74,I_Vd1_boost:I_Vd3_boost,1)-1,0,2))+(AW73-25)*vd_boost_temp_coeff/1000)","v":0.35978123637257764},{"$f":"IF(Reset=1,0.45,FORECAST(AX74, OFFSET(Vd_1_boost:Vd_3_boost,MATCH(AX74,I_Vd1_boost:I_Vd3_boost,1)-1,0,2), OFFSET(I_Vd1_boost:I_Vd3_boost,MATCH(AX74,I_Vd1_boost:I_Vd3_boost,1)-1,0,2))+(AX73-25)*vd_boost_temp_coeff/1000)","v":0.35974526471344687},{"$f":"IF(Reset=1,0.45,FORECAST(AY74, OFFSET(Vd_1_boost:Vd_3_boost,MATCH(AY74,I_Vd1_boost:I_Vd3_boost,1)-1,0,2), OFFSET(I_Vd1_boost:I_Vd3_boost,MATCH(AY74,I_Vd1_boost:I_Vd3_boost,1)-1,0,2))+(AY73-25)*vd_boost_temp_coeff/1000)","v":0.35970817761925183},{"$f":"IF(Reset=1,0.45,FORECAST(AZ74, OFFSET(Vd_1_boost:Vd_3_boost,MATCH(AZ74,I_Vd1_boost:I_Vd3_boost,1)-1,0,2), OFFSET(I_Vd1_boost:I_Vd3_boost,MATCH(AZ74,I_Vd1_boost:I_Vd3_boost,1)-1,0,2))+(AZ73-25)*vd_boost_temp_coeff/1000)","v":0.35967016922167305},{"$f":"IF(Reset=1,0.45,FORECAST(BA74, OFFSET(Vd_1_boost:Vd_3_boost,MATCH(BA74,I_Vd1_boost:I_Vd3_boost,1)-1,0,2), OFFSET(I_Vd1_boost:I_Vd3_boost,MATCH(BA74,I_Vd1_boost:I_Vd3_boost,1)-1,0,2))+(BA73-25)*vd_boost_temp_coeff/1000)","v":0.35963141026441137},{"$f":"IF(Reset=1,0.45,FORECAST(BB74, OFFSET(Vd_1_boost:Vd_3_boost,MATCH(BB74,I_Vd1_boost:I_Vd3_boost,1)-1,0,2), OFFSET(I_Vd1_boost:I_Vd3_boost,MATCH(BB74,I_Vd1_boost:I_Vd3_boost,1)-1,0,2))+(BB73-25)*vd_boost_temp_coeff/1000)","v":0.35959205099135194},{"$f":"IF(Reset=1,0.45,FORECAST(BC74, OFFSET(Vd_1_boost:Vd_3_boost,MATCH(BC74,I_Vd1_boost:I_Vd3_boost,1)-1,0,2), OFFSET(I_Vd1_boost:I_Vd3_boost,MATCH(BC74,I_Vd1_boost:I_Vd3_boost,1)-1,0,2))+(BC73-25)*vd_boost_temp_coeff/1000)","v":0.35955222364914652},{"$f":"IF(Reset=1,0.45,FORECAST(BD74, OFFSET(Vd_1_boost:Vd_3_boost,MATCH(BD74,I_Vd1_boost:I_Vd3_boost,1)-1,0,2), OFFSET(I_Vd1_boost:I_Vd3_boost,MATCH(BD74,I_Vd1_boost:I_Vd3_boost,1)-1,0,2))+(BD73-25)*vd_boost_temp_coeff/1000)","v":0.3595120446603024},{"$f":"IF(Reset=1,0.45,FORECAST(BE74, OFFSET(Vd_1_boost:Vd_3_boost,MATCH(BE74,I_Vd1_boost:I_Vd3_boost,1)-1,0,2), OFFSET(I_Vd1_boost:I_Vd3_boost,MATCH(BE74,I_Vd1_boost:I_Vd3_boost,1)-1,0,2))+(BE73-25)*vd_boost_temp_coeff/1000)","v":0.35947161651400533},{"$f":"IF(Reset=1,0.45,FORECAST(BF74, OFFSET(Vd_1_boost:Vd_3_boost,MATCH(BF74,I_Vd1_boost:I_Vd3_boost,1)-1,0,2), OFFSET(I_Vd1_boost:I_Vd3_boost,MATCH(BF74,I_Vd1_boost:I_Vd3_boost,1)-1,0,2))+(BF73-25)*vd_boost_temp_coeff/1000)","v":0.35943102941454796},{"$f":"IF(Reset=1,0.45,FORECAST(BG74, OFFSET(Vd_1_boost:Vd_3_boost,MATCH(BG74,I_Vd1_boost:I_Vd3_boost,1)-1,0,2), OFFSET(I_Vd1_boost:I_Vd3_boost,MATCH(BG74,I_Vd1_boost:I_Vd3_boost,1)-1,0,2))+(BG73-25)*vd_boost_temp_coeff/1000)","v":0.35939036272112412},{"$f":"IF(Reset=1,0.45,FORECAST(BH74, OFFSET(Vd_1_boost:Vd_3_boost,MATCH(BH74,I_Vd1_boost:I_Vd3_boost,1)-1,0,2), OFFSET(I_Vd1_boost:I_Vd3_boost,MATCH(BH74,I_Vd1_boost:I_Vd3_boost,1)-1,0,2))+(BH73-25)*vd_boost_temp_coeff/1000)","v":0.36036416970529295},"Vf boost diode"]
[null,"Max reverse voltage",{"$f":"V_AbsMax+4","v":40},"Select diode with higher reverse voltage rating",null,null,null,"Pdiss boost diode",{"$f":"I75*I28","v":0.32819833343073679},0.3784232261143482,0.36783522531150048,0.35854495893068861,0.35048979084390874,0.34343082562361399,0.33718721574520144,0.33161951035161824,0.32661843462818729,0.32209713662778,0.3179857108802589,0.31422727861224448,0.31077567518362947,0.30689719891508127,0.31541198932593678,0.3178172944823523,0.31982717313042897,0.321504420143783,0.32290080344386923,0.32405921425555767,0.32501535730322567,0.32579908747851505,0.32643547315693028,0.32694564686693955,0.32734748954930581,0.32765618383762496,0.32788466367097147,0.32804398141247137,0.32814360898224443,0.32819168594617187,0.32819522475940471,0.32816028124328089,{"$f":"AO75*AO28","v":0.32809209672642647},0.32799521699339385,0.32787359217335121,0.32773066090380182,0.32756942147212675,0.32739249213434857,0.32720216240792332,0.32700043681203228,0.32678907226811088,0.32656961016225855,0.32634340389963662,0.32611164264104303,0.32587537179733067,0.32563551076327368,0.32539286829497793,0.32514815587085372,0.32490199932304031,0.32465494898197511,0.32440748853994683,0.33035367407377392,"Pdiss boost diode"]
[null,"Max TJ",{"$f":"IF(Topology=\"Buck\",ROUNDUP(MAX(J152:BH152),0),ROUNDUP(MAX(J69:BH69),0))","v":153},{"$f":"IF(C77>150,\"Buck diode temperature too high\",\"Estimated worse case buck diode temperature\")","v":"Buck diode temperature too high"},null,null,"Boost FET","Tj Boost FET",{"$f":"IF(Reset=1,150,IF(Ta+Rthj_a_boost_FET*I82>190,190,Ta+Rthj_a_boost_FET*I82))","v":125},140.40018200836761,139.59897573346063,138.99271644883589,138.52616806089657,138.16197709769244,137.87415551021806,137.64418273689506,137.45858275269813,137.3073697071201,137.18302291419181,137.07979448741517,136.99323537358913,136.91984365407467,125,125,125,125,125,125,125,125,125,125,125,125,125,125,125,125,125,125,{"$f":"IF(Reset=1,150,IF(Ta+Rthj_a_boost_FET*AO82>190,190,Ta+Rthj_a_boost_FET*AO82))","v":125},125,125,125,125,125,125,125,125,125,125,125,125,125,125,125,125,125,125,125,"Tj Boost FET","Boost FET"]
[null,null,null,null,null,null,null,"Rds thermal Coeff",{"$f":"(I77+40)*(1.34655999666222-0.667409045393858)/0.828125/(190)+0.667409045393858/0.828125","v":1.5181259222823451},{"$f":"(J77+40)*(1.34655999666222-0.667409045393858)/0.828125/(190)+0.667409045393858/0.828125","v":1.584598522946107},{"$f":"(K77+40)*(1.34655999666222-0.667409045393858)/0.828125/(190)+0.667409045393858/0.828125","v":1.5811402349380657},1.5785234066886553,1.5765096197954249,1.5749376435389582,1.5736953043616548,1.5727026610074186,1.5719015462137091,1.5712488575384453,1.5707121330565106,1.5702665628686685,1.5698929432968971,1.5695761588289823,1.5181259222823451,1.5181259222823451,1.5181259222823451,1.5181259222823451,1.5181259222823451,1.5181259222823451,1.5181259222823451,1.5181259222823451,1.5181259222823451,1.5181259222823451,1.5181259222823451,1.5181259222823451,1.5181259222823451,1.5181259222823451,1.5181259222823451,1.5181259222823451,1.5181259222823451,1.5181259222823451,1.5181259222823451,1.5181259222823451,1.5181259222823451,1.5181259222823451,1.5181259222823451,1.5181259222823451,1.5181259222823451,1.5181259222823451,1.5181259222823451,1.5181259222823451,1.5181259222823451,1.5181259222823451,1.5181259222823451,1.5181259222823451,1.5181259222823451,1.5181259222823451,1.5181259222823451,1.5181259222823451,1.5181259222823451,{"$f":"(BH77+40)*(1.34655999666222-0.667409045393858)/0.828125/(190)+0.667409045393858/0.828125","v":1.5181259222823451},"Rds thermal Coeff"]
[null,"Boost Diode (based on SS3P5)",null,null,null,null,null,"Rds_On Boost FET",{"$f":"R_ds_ON_boost*I78","v":2.732626660108221E-2},{"$f":"R_ds_ON_boost*J78","v":2.8522773413029924E-2},2.8460524228885179E-2,2.8413421320395794E-2,2.8377173156317645E-2,2.8348877583701245E-2,2.8326515478509784E-2,2.8308647898133532E-2,2.8294227831846763E-2,2.8282479435692013E-2,2.8272818395017187E-2,2.8264798131636033E-2,2.8258072979344146E-2,2.8252370858921679E-2,2.732626660108221E-2,2.732626660108221E-2,2.732626660108221E-2,2.732626660108221E-2,2.732626660108221E-2,2.732626660108221E-2,2.732626660108221E-2,2.732626660108221E-2,2.732626660108221E-2,2.732626660108221E-2,2.732626660108221E-2,2.732626660108221E-2,2.732626660108221E-2,2.732626660108221E-2,2.732626660108221E-2,2.732626660108221E-2,{"$f":"R_ds_ON_boost*AM78","v":2.732626660108221E-2},2.732626660108221E-2,2.732626660108221E-2,2.732626660108221E-2,2.732626660108221E-2,2.732626660108221E-2,2.732626660108221E-2,2.732626660108221E-2,{"$f":"R_ds_ON_boost*AU78","v":2.732626660108221E-2},2.732626660108221E-2,2.732626660108221E-2,2.732626660108221E-2,2.732626660108221E-2,2.732626660108221E-2,2.732626660108221E-2,2.732626660108221E-2,2.732626660108221E-2,2.732626660108221E-2,2.732626660108221E-2,2.732626660108221E-2,2.732626660108221E-2,{"$f":"R_ds_ON_boost*BH78","v":2.732626660108221E-2},"Rds_On Boost FET"]
[null,"Max Peak current",{"$f":"IF(Topology=\"Buck\",\"-\",MAX(J22:BH22))","v":2.0147495423065558},{"$f":"IF(Topology=\"Buck\",\"\",\"Maximum peak diode current\")","v":"Maximum peak diode current"},null,null,null,"Conduction Losses",{"$f":"I27^2*I79","v":0},6.1133700139459915E-2,4.778026222434377E-2,3.7675940813931476E-2,2.9900134348276295E-2,2.383028496154058E-2,1.9033258503634326E-2,1.520037894825085E-2,1.2107045878302344E-2,9.5868284520014956E-3,7.5143819031966265E-3,5.7939081235863351E-3,4.3512562264856579E-3,3.1280609012442656E-3,0,0,0,0,0,0,0,0,0,0,0,0,0,0,0,0,0,0,{"$f":"AO27^2*AO79","v":0},0,0,0,0,0,0,0,0,0,0,0,0,0,0,0,0,0,0,0,"Conduction Losses"]
[null,"Max Average current",{"$f":"IF(Topology=\"Buck\",\"-\",MAX(J28:BG28))","v":0.91162430656467841},{"$f":"IF(Topology=\"Buck\",\"\",\"Maximum average diode current\")","v":"Maximum average diode current"},null,null,null,"Switching Losses",{"$f":"IF(I14=0,0,0.5*Vreg*Iout_PreReg*I19*10^3*(t_rise_boost+t_fall_boost)*10^-9)","v":0},0.19553600000000002,0.19553600000000002,0.19553600000000002,0.19553600000000002,0.19553600000000002,0.19553600000000002,0.19553600000000002,0.19553600000000002,0.19553600000000002,0.19553600000000002,0.19553600000000002,0.19553600000000002,0.19553600000000002,0,0,0,0,0,0,0,0,0,0,0,0,0,0,0,0,0,0,{"$f":"IF(AO14=0,0,0.5*Vreg*Iout_PreReg*AO19*10^3*(t_rise_boost+t_fall_boost)*10^-9)","v":0},0,0,0,0,0,0,0,0,0,0,0,0,0,0,0,0,0,0,0,"Switching Losses"]
[null,"max Power diss",{"$f":"IF(Topology=\"Buck\",\"-\",MAX(J76:BH76))","v":0.3784232261143482},{"$f":"IF(Topology=\"Buck\",\"\",\"Maximum diode power dissipation\")","v":"Maximum diode power dissipation"},null,null,null,"Total Boost FET Losses",{"$f":"I80+I81","v":0},{"$f":"J80+J81","v":0.25666970013945994},{"$f":"K80+K81","v":0.24331626222434377},0.23321194081393148,0.22543613434827631,0.21936628496154059,0.21456925850363434,0.21073637894825087,0.20764304587830235,0.2051228284520015,0.20305038190319663,0.20132990812358634,0.19988725622648568,0.19866406090124428,0,0,0,0,0,0,0,0,0,0,0,0,0,0,0,0,{"$f":"AM80+AM81","v":0},0,0,0,0,0,0,0,0,0,0,0,0,0,0,0,0,0,0,0,0,{"$f":"BH80+BH81","v":0},"Total Boost FET Losses"]
[null,"Max reverse voltage",{"$f":"IF(Topology=\"Buck\",\"-\",Vreg+4)","v":9.35},{"$f":"IF(Topology=\"Buck\",\"\",\"Select diode with higher reverse voltage rating\")","v":"Select diode with higher reverse voltage rating"},null,null,null,"Pout",{"$f":"I21*Iout_PreReg","v":4.444},4.444,4.444,4.444,4.444,4.444,4.444,4.444,4.444,4.444,4.444,4.444,4.444,4.444,4.444,4.444,4.444,4.444,4.444,4.444,4.444,4.444,4.444,4.444,4.444,4.444,4.444,4.444,4.444,4.444,4.444,4.444,{"$f":"AO21*Iout_PreReg","v":4.444},4.444,4.444,4.444,4.444,4.444,4.444,4.444,4.444,4.444,4.444,4.444,4.444,4.444,4.444,4.444,4.444,4.444,4.444,4.444]
[null,"Max TJ",{"$f":"IF(Topology=\"Buck\",\"-\",ROUNDUP(MAX(J73:BH73),0))","v":171},{"$f":"IF(Topology=\"Buck\",\"\",IF(C84>150,\"Boost diode temperature too high\",\"Estimated worse case boost diode temperature\"))","v":"Boost diode temperature too high"},null,null,null,"P loss",{"$f":"I82+I76+I72+I3+I24^2*dcr*10^-3","v":1.1176928726417223},1.8826214480798067,1.7233516680219141,1.6007992228992074,1.5047392177035865,1.4282996538093597,1.3667886972175609,1.3168972323709252,1.2762281275908776,1.243005576172413,1.2158888187439032,1.1938409994238028,1.1758157651539702,1.1527478537159239,0.92032583339655749,0.93456399059204875,0.9482414746966733,0.96147078606533987,0.97434602279706151,0.98694633983328584,0.9993386805998612,1.0115799490039372,1.0237187477817302,1.0357967784928439,1.047849975753566,1.0599094313913373,1.0720021515182141,1.084151679940967,1.0963786140413758,1.1087010336860494,1.1211348594326953,1.1336941529743976,{"$f":"AO82+AO76+AO72+AO3+AO24^2*dcr*10^-3","v":1.1463913701723696},1.1592375749972912,1.1722426210998824,1.1854153064647532,1.1987635055935764,1.2122942828575691,1.2260139900117286,1.2399283503407237,1.2540425314829153,1.2683612086343674,1.2828886195532254,1.2976286125539296,1.3125846884907018,1.3277600375727334,1.3431575717233624,1.3587799530872606,1.3746296191993597,1.3907088052536194,1.4070195638462786,1.9694832745851434]
[null,null,null,null,null,null,null,"Efficiency",{"$f":"I83/(I83+I84)","v":0.79903728986192024},{"$f":"J83/(J83+J84)","v":0.70242862426181651},0.72056860695043623,0.73517743702140159,0.74704905314634606,0.7567733702276549,0.76478430580825729,0.77140761599231833,0.7768920925661803,0.78143056842068259,0.78517443404237308,0.78824500379740836,0.79077325409051813,0.79403255536149187,0.82843588141739899,0.82624284247119717,0.82414706775534119,0.82213005598996158,0.82017648583209457,0.81827359762431717,0.81641071055131675,0.81457884249526424,0.81277040846384863,0.81097897962965548,0.80919908949082586,0.80742607693611668,0.80565595841488957,0.80388532321303019,0.80211124718755766,0.80033122133534706,0.79854309235068877,0.79674501292441136,0.79493539999919138,0.79311289955470943,0.79127635677706687,0.78942479068768723,0.7875573724815399,0.78567340696334553,0.78377231658132251,0.78185362764708388,0.7799169584021074,0.77796200864938136,0.77598855071616391,0.7739964215524674,0.77198551580158481,0.76995577970509121,0.76790720572631954,0.76583982779420279,0.76375371708424566,0.76164897826581957,0.75952574615536783,0.6929151928422953]
[null," Compensation Components, Pre-Regulator",null,null,null,null,null,null,null,null,null,{"$f":"L80/L83","v":8.4779344765822402E-3}]
[null,"fcMAX",{"$f":"ROUNDDOWN(fsw/40,0)","v":50},"Recommended maximum 0dB crossover frequency",null,null,"Buck Only Mode Calculations",null,{"$f":"I2","v":12},{"$f":"Vin_min_Buck","v":6},{"$f":"J87+(Vin_max-Vin_min_Buck)/49","v":6.2448979591836737},6.4897959183673475,6.7346938775510212,6.979591836734695,7.2244897959183687,7.4693877551020424,7.7142857142857162,7.9591836734693899,8.2040816326530628,8.4489795918367356,8.6938775510204085,8.9387755102040813,9.1836734693877542,9.428571428571427,9.6734693877550999,9.9183673469387728,10.163265306122446,10.408163265306118,10.653061224489791,10.897959183673464,11.142857142857137,11.38775510204081,11.632653061224483,11.877551020408156,12.122448979591828,12.367346938775501,12.612244897959174,12.857142857142847,13.10204081632652,13.346938775510193,13.591836734693866,13.836734693877538,{"$f":"AP87+(Vin_max-Vin_min_Buck)/49","v":14.081632653061211},14.326530612244884,14.571428571428557,14.81632653061223,15.061224489795903,15.306122448979576,15.551020408163248,15.795918367346921,16.040816326530596,16.28571428571427,16.530612244897945,16.77551020408162,17.020408163265294,17.265306122448969,17.510204081632644,17.755102040816318,17.999999999999993,{"$f":"BH2","v":36},null,"Buck Only Mode Calculations"]
[null,"fc =",40,"Choose fc considering recommended fcMAX",null,null,"Buck","Pdiss total",{"$f":"I111+I115+I139+I143+I147+I151+IF(I99<5,I2*Icc,I99*Icc)","v":0.4637592981189852},0.36556756408994112,0.36553492154338735,0.36601733170498629,0.36697710366640751,0.36838205300345289,0.36313058259342529,0.3655751468078895,0.36837793500655042,0.37152215611838391,0.37499306469598076,0.37877765469890484,0.38286440721499332,0.38724308127387735,0.39190453934159875,0.39684060091998008,0.40204391906940784,0.40750787574325015,0.41322649264859962,0.4191943549914916,0.42540654596919353,0.43185859027036577,0.4385464051601029,0.44546625797961614,0.45261472909338452,0.459988679480694,0.46758522230178706,0.47540169787761127,0.48343565161137425,0.49168481445360923,0.50014708557323595,0.50882051694762165,{"$f":"AO111+AO115+AO139+AO143+AO147+AO151+IF(AO99<5,AO2*Icc,AO99*Icc)","v":0.5177032996267581},0.52679375146192875,0.53609030611887332,0.54559150322041194,0.55529597948464393,0.56520246074273151,0.57530975473556922,0.58561674460164448,0.59612238297955844,0.60682568665826064,0.61772573171627188,0.62882164909831517,0.64011262058389917,0.65159787510776157,0.66327668539670492,0.67514836489140473,0.6872122649253054,0.6994677721357927,0.71191430608555706,1.1617385790493264,"Pdiss total","Buck"]
[null,"R_LOADTYP",{"$f":"Vreg/Iout_PreReg","v":6.4407065706570643},null,null,null,null,"Tj",{"$f":"IF(Reset=1,150,Ta+Rth_ja*I88)","v":138.91277894356955},{"$f":"IF(Reset=1,150,Ta+Rth_ja*J88)","v":135.96702692269824},{"$f":"IF(Reset=1,150,Ta+Rth_ja*K88)","v":135.96604764630163},135.98051995114957,136.00931310999223,136.0514615901036,135.89391747780274,135.96725440423668,136.05133805019651,136.14566468355153,136.24979194087942,136.36332964096715,136.48593221644981,136.61729243821631,136.75713618024795,136.9052180275994,137.06131757208223,137.22523627229751,137.39679477945799,137.57583064974474,137.76219637907582,137.95575770811098,138.15639215480309,138.36398773938848,138.57844187280153,138.79966038442083,139.02755666905361,139.26205093632834,139.50306954834122,139.75054443360827,140.00441256719708,140.26461550842865,140.53109898880274,{"$f":"IF(Reset=1,150,Ta+Rth_ja*AP88)","v":140.80381254385787},141.08270918356621,141.36774509661237,141.65887938453932,141.95607382228195,142.25929264206707,142.56850233804934,142.88367148938676,143.2047705997478,143.53177195148817,143.86464947294945,144.20337861751699,144.54793625323285,144.89830056190115,145.25445094674214,145.61636794775916,145.98403316407379,{"$f":"IF(Reset=1,150,Ta+Rth_ja*BG88)","v":146.3574291825667},{"$f":"IF(Reset=1,150,Ta+Rth_ja*BH88)","v":159.85215737147979},"Tj"]
[null,"fP1",{"$f":"wp/(2*PI())","v":0.83433033003785873},"Dominant pole formed by Co and RLOAD.",null,null,null,null,null,{"$f":"J87","v":6},{"$f":"K87","v":6.2448979591836737},6.4897959183673475,6.7346938775510212,6.979591836734695,7.2244897959183687,7.4693877551020424,7.7142857142857162,7.9591836734693899,8.2040816326530628,8.4489795918367356,8.6938775510204085,8.9387755102040813,9.1836734693877542,9.428571428571427,9.6734693877550999,9.9183673469387728,10.163265306122446,10.408163265306118,10.653061224489791,10.897959183673464,11.142857142857137,11.38775510204081,11.632653061224483,11.877551020408156,12.122448979591828,12.367346938775501,12.612244897959174,12.857142857142847,13.10204081632652,13.346938775510193,13.591836734693866,13.836734693877538,14.081632653061211,14.326530612244884,14.571428571428557,14.81632653061223,15.061224489795903,15.306122448979576,15.551020408163248,15.795918367346921,16.040816326530596,16.28571428571427,16.530612244897945,16.77551020408162,17.020408163265294,17.265306122448969,17.510204081632644,17.755102040816318,17.999999999999993,36]
[null,"fZ1",{"$f":"wz/(2*PI())","v":6241.3703173292288},"Zero formed by the output capacitance and its ESR",null,null,null,"V1",{"$f":"IF(Reset=1,I2-Vreg,I2-Iout_PreReg*(I108+dcr*10^-3)-Vreg)","v":6.4746243999477855},{"$f":"IF(Reset=1,J87-Vreg,J87-Iout_PreReg*(J108+dcr*10^-3)-Vreg)","v":0.46522089088689178},0.71011927913174056,0.95501089740478307,1.1998962411240282,1.4447757333289841,1.7004419463425338,1.9453076506049021,2.190168628263506,2.4350251008689474,2.6798772629807477,2.9247252862077406,3.1695693225367716,3.414409507092822,3.6592459604415275,3.9040787905208703,4.1489080942704,4.3937339590122555,4.638556463627312,4.8833756795613343,5.1281916716893114,5.3730044990609596,5.6178142155461188,5.862620870395542,6.1074245087297712,6.3522251719667722,6.5970228981970891,6.8418177225139871,7.0866096773047644,7.3313987925085016,7.5761850958447194,7.8209686130166958,8.0657493678927086,{"$f":"IF(Reset=1,AP87-Vreg,AP87-Iout_PreReg*(AP108+dcr*10^-3)-Vreg)","v":8.3105273826679529},8.5553026780095021,8.8000752731863709,9.0448451861864516,9.2896124338218264,9.5343770318238139,9.7791389949288998,10.023898336956544,10.268655070879774,10.513409208889316,10.75816076245196,11.002909742363761,11.247656158798572,11.492400021352433,11.737141339084191,11.981880120552704,12.226616373851018,12.471350106637734,30.465414878411927,"V1"]
[null,"fP2",{"$f":"IF(fz_1>10*fc,MAX(fsw/2,5*fc),fz_1)","v":1000},null,null,null,null,"V3",{"$f":"IF(Reset=1,Vreg,Vreg+I154+Iout_PreReg*dcr*10^-3)","v":5.7283513264479415},{"$f":"IF(Reset=1,Vreg,Vreg+J154+Iout_PreReg*dcr*10^-3)","v":5.7471307201225654},5.745611884742778,5.7442147659763343,5.7429253577081312,5.74173171491449,5.7405765752437228,5.739548332578801,5.7385887827215178,5.7376912849199169,5.7368500252765786,5.7360598922848514,5.7353163741329736,5.734615473471151,5.733953636280626,5.733327692201625,5.7327348042272828,5.7321724260955458,5.7316382660414735,5.7311302558310713,5.7306465242016351,5.7301853739951616,5.7297452624001979,5.7293247838208075,5.7289226549744967,5.7285377018884045,5.7281688485178632,5.7278151067562826,5.7274755676421316,5.7271493935991185,5.7268358115708144,5.7265341069318252,{"$f":"IF(Reset=1,Vreg,Vreg+AO154+Iout_PreReg*dcr*10^-3)","v":5.7262436180750411},5.7259637315890508,5.7256938779520672,5.7254335276790123,5.7251821878671221,5.7249393990928557,5.7247047326191316,5.7244777878773299,5.7242581901930381,5.7240455887284725,5.7238396546179002,5.7236400792752544,5.7234465728557122,5.7232588628551255,5.7230766928331294,5.722899821247375,5.7227280203877671,5.7225610754008516,5.7223987833955832,5.7165870491100774,"V3"]
[null,"Rz",{"$f":"fc*10^3*Vreg/VFB*2*PI()*Co_tot*10^-6/(gm_POWER1*gm_EA1*10^-6)*10^-3","v":21.165026062517903},"Recommended compensation resister to achieve chosen fc",{"$f":"10^(-1*Gain1_at_fco/20)/(gm_EA1*10^-6)*10^-3/FB_Gain1","v":21.202682174493869},null,null,"Required Buck duty",{"$f":"IF(Reset=1,Vreg/I2,I92/(I91+I92))","v":0.46942249619141607},{"$f":"IF(Reset=1,Vreg/J87,J92/(J91+J92))","v":0.92511356085150864},0.89000172697625934,0.85744458458460315,0.82717455373966964,0.79895996160386418,0.77147725927444166,0.7468647877251442,0.72376899497150693,0.70205437385505109,0.68160103432130881,0.66230252501000275,0.64406400817450937,0.62680072309931034,0.6104366863748476,0.59490358764882179,0.58013984750438985,0.56608981044164774,0.55270305095076422,0.53993377465846215,0.52774029972839531,0.51608460627161601,0.50493194360741689,0.49425048690914752,0.48401103615328483,0.47418675142493966,0.46475291956772991,0.45568674793890629,0.44696718167226984,0.43857474138602676,0.43049137871973814,0.42270034745957852,0.41518608832683113,{"$f":"IF(Reset=1,Vreg/AP87,AP92/(AP91+AP92))","v":0.40793412577115745},0.40093097533602373,0.39416406035552498,0.38762163690532614,0.38129272607010001,0.37516705270948653,0.36923499000735566,0.36348750917763001,0.35791613377628789,0.35251289813523012,0.34727030949097698,0.34218131343094088,0.33723926232337204,0.33243788643490252,0.32777126747269919,0.32323381431721282,0.31882024073695758,0.31452554489912515,0.1579953221096296,"Required Buck duty"]
[null,"Actual Rz used = ",22.1,"Enter the closest available 1% standard resister value",null,null,null,"ton buck",{"$f":"I93/(fsw*10^3)*10^6","v":0.23471124809570804},{"$f":"J93/(fsw*10^3)*10^6","v":0.46255678042575432},0.44500086348812967,0.42872229229230158,0.41358727686983482,0.39947998080193209,0.38573862963722083,0.3734323938625721,0.36188449748575346,0.35102718692752555,0.3408005171606544,0.33115126250500138,0.32203200408725469,0.31340036154965517,0.3052183431874238,0.29745179382441089,0.29006992375219492,0.28304490522082387,0.27635152547538211,0.26996688732923108,0.26387014986419766,0.258042303135808,0.25246597180370844,0.24712524345457376,0.24200551807664242,0.23709337571246983,0.23237645978386495,0.22784337396945314,0.22348359083613492,0.21928737069301338,0.21524568935986907,0.21135017372978926,0.20759304416341556,{"$f":"AP93/(fsw*10^3)*10^6","v":0.20396706288557873},0.20046548766801187,0.19708203017776249,0.19381081845266307,0.19064636303505,0.18758352635474326,0.18461749500367783,0.181743754588815,0.17895806688814395,0.17625644906761506,0.17363515474548849,0.17109065671547044,0.16861963116168602,0.16621894321745126,0.1638856337363496,0.16161690715860641,0.15941012036847879,0.15726277244956258,{"$f":"IF(BH93>1,1000/fsw,IF(BH93*1000/fsw<0.16,0.16,BH93*1000/fsw))","v":0.16},"ton buck"]
[null,"Cz (min)",{"$f":"4*1000000000/(6.28*Rz*1000*fc*1000)","v":0.7205233881891806},"Recommended range for the compensation capacitor",null,null,null,"toff buck",{"$f":"1/(fsw*10^-3)-I94","v":0.26528875190429196},3.7443219574245679E-2,5.4999136511870328E-2,7.1277707707698423E-2,8.6412723130165181E-2,0.10052001919806791,0.11426137036277917,0.1265676061374279,0.13811550251424654,0.14897281307247445,0.1591994828393456,0.16884873749499862,0.17796799591274531,0.18659963845034483,0.1947816568125762,0.20254820617558911,0.20993007624780508,0.21695509477917613,0.22364847452461789,0.23003311267076892,0.23612985013580234,0.241957696864192,0.24753402819629156,0.25287475654542624,0.25799448192335761,0.2629066242875302,0.26762354021613505,0.27215662603054686,0.27651640916386511,0.28071262930698659,0.2847543106401309,0.28864982627021074,{"$f":"1/(fsw*10^-3)-AO94","v":0.29240695583658444},0.29603293711442125,0.29953451233198813,0.30291796982223751,0.30618918154733693,0.30935363696495,0.31241647364525671,0.31538250499632214,0.31825624541118502,0.32104193311185603,0.32374355093238494,0.32636484525451148,0.32890934328452959,0.33138036883831401,0.33378105678254877,0.33611436626365043,0.33838309284139356,0.34058987963152121,0.34273722755043745,{"$f":"BH94/BH93-BH94","v":0.8526882104077701},"toff buck"]
[null,"Cz (max)",{"$f":"1000000000/(6.28*Rz*1000*1.5*fp_1*1000)","v":5.7572990956430576},null,null,null,null,"Actual fsw",{"$f":"1/(I94+I95)*10^3","v":2000},2000,2000,2000,2000,2000,2000,2000,2000,2000,2000,2000,2000,2000,2000,2000,2000,2000,2000,2000,2000,2000,2000,2000,2000,2000,2000,2000,2000,2000,2000,2000,2000,2000,2000,2000,2000,2000,2000,2000,2000,2000,2000,2000,2000,2000,2000,2000,2000,2000,2000,{"$f":"1/(BH94+BH95)*10^3","v":987.47076318518498},"Actual fsw"]
[null,"Cp",{"$f":"MAX(1/(2*PI()*Rz*10^3*fz_1*10^3)*10^12, 1/(2*PI()*Rz*10^3*fsw/2*10^3)*10^12, 1/(2*PI()*Rz*10^3*10*fc*10^3)*10^12)","v":18.003952838449699},"Recommended HF compensation capacitor",null,null,null,"VREG_actual",{"$f":"I91*I93/(1-I93)-I154-Iout_PreReg*dcr*10^-3","v":5.3499999999999988},5.349999999999997,5.3500000000000014,5.3500000000000023,5.3499999999999988,5.35,5.3500000000000005,5.3499999999999988,5.35,5.3500000000000005,5.3499999999999988,5.3499999999999988,5.3500000000000023,5.3500000000000023,5.3500000000000005,5.3500000000000005,5.35,5.35,5.35,5.3500000000000014,5.35,5.3500000000000014,5.3500000000000014,5.3499999999999979,5.3499999999999988,5.3499999999999988,5.3499999999999988,5.3500000000000005,5.35,5.35,5.3500000000000014,5.3499999999999988,{"$f":"AO91*AO93/(1-AO93)-AO154-Iout_PreReg*dcr*10^-3","v":5.3500000000000005},5.35,5.3500000000000005,5.35,5.35,5.3500000000000005,5.35,5.3500000000000005,5.3499999999999979,5.3500000000000005,5.3500000000000005,5.35,5.3499999999999988,5.3500000000000005,5.3499999999999979,5.35,5.35,5.3499999999999988,5.3499999999999979,5.3500000000000005,"VREG_actual"]
[null,"Actual Cz used =",1.5,"Enter actual Cz used",null,null,null,"New duty cycle",{"$f":"IF(I95*10^-6<0,(1/(I96*10^3))*(I96*10^3),I93)","v":0.46942249619141607},{"$f":"IF(J95*10^-6<0,(1/(J96*10^3))*(J96*10^3),J93)","v":0.92511356085150864},{"$f":"IF(K95*10^-6<0,(1/(K96*10^3))*(K96*10^3),K93)","v":0.89000172697625934},0.85744458458460315,0.82717455373966964,0.79895996160386418,0.77147725927444166,0.7468647877251442,0.72376899497150693,0.70205437385505109,0.68160103432130881,0.66230252501000275,0.64406400817450937,0.62680072309931034,0.6104366863748476,0.59490358764882179,0.58013984750438985,0.56608981044164774,0.55270305095076422,0.53993377465846215,0.52774029972839531,0.51608460627161601,0.50493194360741689,0.49425048690914752,0.48401103615328483,0.47418675142493966,0.46475291956772991,0.45568674793890629,0.44696718167226984,0.43857474138602676,0.43049137871973814,0.42270034745957852,0.41518608832683113,0.40793412577115745,0.40093097533602373,0.39416406035552498,0.38762163690532614,0.38129272607010001,0.37516705270948653,0.36923499000735566,0.36348750917763001,0.35791613377628789,0.35251289813523012,0.34727030949097698,0.34218131343094088,0.33723926232337204,0.33243788643490252,0.32777126747269919,0.32323381431721282,0.31882024073695758,0.31452554489912515,0.1579953221096296,"New duty cycle"]
[null,"Actual Cp used =",22,"Enter actual Cp used",null,null,null,"New VREG",{"$f":"(I2-Iout_PreReg*I108+I154)*I98-I154-Iout_PreReg*dcr*10^-3","v":5.35},{"$f":"(J87-Iout_PreReg*J108+J154)*J98-J154-Iout_PreReg*dcr*10^-3","v":5.35},5.35,5.35,5.35,5.35,5.35,5.35,5.35,5.35,5.35,5.35,5.35,5.3500000000000005,5.35,5.35,5.35,5.3500000000000005,5.35,5.3500000000000014,5.35,5.35,5.3500000000000005,5.35,5.35,5.35,5.3499999999999988,5.35,5.35,5.35,5.35,5.35,5.3500000000000005,{"$f":"(AP87-Iout_PreReg*AP108+AP154)*AP98-AP154-Iout_PreReg*dcr*10^-3","v":5.35},5.3500000000000005,5.35,5.35,5.35,5.3499999999999988,5.35,5.3499999999999988,5.35,5.35,5.35,5.35,5.35,5.35,5.35,5.35,5.35,5.35,5.3500000000000005,"New VREG"]
[null,"Estimated cross over",{"$f":"'Control Loop1'!$B$21","v":38.5352859371054},null,null,null,null,"New V1",{"$f":"IF(Reset=1,I2,I2-Iout_PreReg*(I108+dcr*10^-3)-I99)","v":6.4746243999477855},{"$f":"IF(Reset=1,J87,J87-Iout_PreReg*(J108+dcr*10^-3)-J99)","v":0.46522089088689178},0.71011927913174056,0.95501089740478307,1.1998962411240282,1.4447757333289841,1.7004419463425338,1.9453076506049021,2.190168628263506,2.4350251008689474,2.6798772629807477,2.9247252862077406,3.1695693225367716,3.4144095070928211,3.6592459604415275,3.9040787905208703,4.1489080942704,4.3937339590122546,4.638556463627312,4.8833756795613326,5.1281916716893114,5.3730044990609596,5.6178142155461179,5.862620870395542,6.1074245087297712,6.3522251719667722,6.59702289819709,6.8418177225139871,7.0866096773047644,7.3313987925085016,7.5761850958447194,7.8209686130166958,8.0657493678927068,{"$f":"IF(Reset=1,AP87,AP87-Iout_PreReg*(AP108+dcr*10^-3)-AP99)","v":8.3105273826679529},8.5553026780095003,8.8000752731863709,9.0448451861864516,9.2896124338218264,9.5343770318238157,9.7791389949288998,10.023898336956545,10.268655070879774,10.513409208889316,10.75816076245196,11.002909742363761,11.247656158798572,11.492400021352433,11.737141339084191,11.981880120552704,12.226616373851018,12.471350106637734,30.465414878411927,"New V1"]
[null,"Estimated phase margin",{"$f":"'Control Loop1'!$B$22","v":66.710339269286592},null,null,null,null,"Vin - VREG",{"$f":"I2-I99","v":6.65},{"$f":"J87-J99","v":0.65000000000000036},0.8948979591836741,1.1397959183673478,1.3846938775510216,1.6295918367346953,1.8744897959183691,2.1193877551020428,2.3642857142857165,2.6091836734693903,2.8540816326530631,3.098979591836736,3.3438775510204088,3.5887755102040808,3.8336734693877546,4.0785714285714274,4.3234693877551003,4.5683673469387722,4.813265306122446,5.058163265306117,5.3030612244897917,5.5479591836734645,5.7928571428571365,6.0377551020408102,6.2826530612244831,6.5275510204081559,6.7724489795918297,7.0173469387755016,7.2622448979591745,7.5071428571428473,7.7520408163265202,7.9969387755101931,8.2418367346938659,{"$f":"AP87-AP99","v":8.4867346938775388},8.7316326530612116,8.9765306122448845,9.2214285714285573,9.4663265306122302,9.711224489795903,9.9561224489795759,10.201020408163249,10.445918367346922,10.690816326530596,10.935714285714271,11.180612244897945,11.42551020408162,11.670408163265295,11.915306122448969,12.160204081632644,12.405102040816319,12.649999999999993,30.65]
[null,null,null,null,null,null,"Circuit Currents","Ilpk",{"$f":"Iout_PreReg+I103/2","v":0.99232092623116497},0.85354687342401303,0.86427161969185895,0.87421106317125397,0.8834480161279914,0.89205409733230223,0.90043358285852115,0.90793515164626015,0.91497208576154065,0.92158612169853427,0.92781415849587223,0.93368893656577401,0.93923960571705101,0.94449220284167568,0.94947005553952313,0.95419412470027132,0.95868329651810213,0.96295463241536383,0.96702358376993436,0.97090417708305554,0.97460917421822024,0.97815021153266268,0.9815379210692361,0.98478203644560047,0.98789148564461837,0.99087447255506456,0.99373854881983115,0.99649067730764551,0.99913728832430349,1.0016843295129152,1.0041373102535471,1.00650134125602,{"$f":"Iout_PreReg+AO103/2","v":1.0087811699415183},1.0109812121258765,1.0131055804473301,1.015158109922019,1.0171423809598625,1.0190617401301694,1.0209193189293044,1.0227180507709401,1.0244606863920578,1.0261498078442619,1.0277878412195613,1.0293770682420713,1.0309196368417388,1.0324175708128045,1.0338727786480528,1.0352870616297023,1.0366621212488509,1.0379995660175623,1.0393009177307744,1.3492144588570416,"Ilpk","Circuit Currents"]
[null,"Inductor Calculation, Adjustable Buck",null,null,null,null,null,"ΔIL",{"$f":"I100*I98/(L_buck*10^-6*I96*10^3)","v":0.32333344124737645},4.5785335633072723E-2,6.7234828168764402E-2,8.71137151275546E-2,0.10558762104102926,0.12279978344965105,0.13955875450208885,0.15456189207756693,0.16863576030812782,0.18186383218211505,0.19431990577679101,0.20606946191659464,0.21717080021914867,0.22767599446839787,0.23763169986409285,0.24707983818558923,0.2560581818212509,0.26460085361577423,0.27273875632491518,0.28049994295115777,0.287909937221487,0.29499201185037199,0.30176743092351888,0.30825566167624752,0.31447456007428332,0.32044053389517574,0.32616868642470898,0.33167294340033759,0.33696616543365365,0.34206024781087713,0.34696620929214089,0.35169427129708669,{"$f":"AO100*AO98/(L_buck*10^-6*AO96*10^3)","v":0.35625392866808336},0.36065401303679961,0.36490274967970687,0.36900780862908461,0.37297635070477142,0.3768150690453852,0.38053022664365566,0.38412769032692706,0.38761296156916192,0.39099120447357039,0.3942672712241691,0.39744572526918898,0.40053086246852415,0.40352673041065557,0.40643714608115222,0.409265712044451,0.41201583128274855,0.41469072082017111,0.41729342424659527,1.0371205064991296,"ΔIL"]
[null,"Ripple Current",0.2,"Select desired inductor ripple current, 20% to 35%",null,null,null,"IL RMS",{"$f":"SQRT((I102-I103/2)^2+I103^2/12)","v":0.83588184101928786},{"$f":"SQRT((J102-J103/2)^2+J103^2/12)","v":0.83075935186228322},{"$f":"SQRT((K102-K103/2)^2+K103^2/12)","v":0.83088092977872696},0.83103478220850169,0.83121325268337753,0.83141028270924189,0.8316306049702813,0.83185166396035093,0.83207946992136106,0.83231160856259356,0.83254615173883706,0.83278156072762421,0.83301660987784254,0.83325032603143101,0.83348194023130839,0.83371084905371895,0.83393658352010713,0.83415878400811949,0.83437717993334815,0.83459157324187916,0.83480182495964972,0.83500784420348351,0.83520957918191796,0.83540700980999472,0.83560014163746266,0.83578900084908203,0.83597363014255599,0.83615408532680657,0.83633043251295702,0.83650274579411343,0.83667110532909006,0.8368355957605933,0.83699630491080534,0.83715332270738618,0.83730674030113106,0.83745664934321107,0.83760314139541991,0.83774630745134382,0.83788623755008895,0.83802302046724608,0.83815674347031088,0.83828749212786735,0.83841535016358948,0.83854039934755142,0.8386627194185613,0.83878238803222838,0.83889948073032217,0.83901407092769265,0.83912622991360641,0.83923602686486098,0.83934352886844976,0.88296167605214093,"IL RMS"]
[null,"L calculated",{"$f":"ROUNDUP((Vreg-Vout_sync_buck)*Vout_sync_buck/(Vreg*fsw*10^-3*k_ripple2*Iout_sync_buck),2)","v":4.5199999999999996},"Recommended minimum inductor value",null,null,null,"Isw buck RMS",{"$f":"SQRT(I98*((I102-I103/2)^2+I103^2/12))","v":0.57269954731198913},{"$f":"SQRT(J98*((J102-J103/2)^2+J103^2/12))","v":0.79904780422445143},{"$f":"SQRT(K98*((K102-K103/2)^2+K103^2/12))","v":0.7838522619530951},0.7695241113801371,0.75598128069238857,0.74315242530327819,0.73045258100617472,0.71889734854329634,0.7078883973294422,0.69738295214150459,0.6873428797340303,0.67773405061134873,0.66852580602509748,0.65969051015414926,0.65120317171852427,0.64304112255859558,0.63518374323630922,0.62761222767495495,0.62030938038619843,0.61325944103937557,0.60644793208410364,0.59986152589979935,0.59348792855756316,0.58731577777365762,0.58133455303446913,0.57553449619962904,0.56990654115784023,0.56444225133055581,0.55913376400116765,0.55397374059900362,0.54895532219394327,0.54407208956343689,0.53931802728281764,0.53468749136497218,0.53017518003912123,0.52577610731254332,0.5214855790051941,0.51729917098659295,0.51321270937816288,0.50922225251328113,0.5053240744723756,0.50151465003208529,0.49779064088629882,0.49414888301321813,0.49058637507682856,0.48710026776357945,0.48368785396595054,0.48034655973412088,0.47707393592532854,0.47386765048789925,0.4707254813234209,0.35096512902917226,"Isw buck RMS"]
[null,"Irms",{"$f":"IF(Topology=\"buck\",MAX(J192:BG192),MAX(J45:BG45))","v":0.7009698118777361},"Maximum RMS inductor current, must be less than inductor DC rating",null,null,null,"I buck Diode avg",{"$f":"(I102-I103/2)*(1-I98)","v":0.44072643493931724},{"$f":"(J102-J103/2)*(1-J98)","v":6.2204735621662732E-2},{"$f":"(K102-K103/2)*(1-K98)","v":9.1370528096729631E-2},0.11841425534692031,0.14355818377213239,0.16699475338923883,0.18982337566063204,0.21026782866345034,0.22945244604609782,0.24748978739965477,0.26447943990207545,0.2805098278234669,0.29565972853691225,0.30999954888722708,0.3235924048131173,0.33649503859600677,0.34875860143747506,0.36042932381258275,0.371549091883141,0.38215594493790545,0.39228450616953486,0.4019663569586801,0.41123036310441857,0.42010296003285019,0.42860840286631824,0.43676898629300348,0.44460523840018845,0.45213609199243004,0.45937903638288469,0.46635025220196202,0.47306473139616517,0.47953638427843609,0.48577813522907709,0.49180200842485539,0.49761920478630106,0.50324017117384057,0.5086746627276133,0.51393179912980869,0.51902011546897975,0.52394760830043197,0.52872177742329218,0.53334966383143489,0.53783788424056789,0.5421926625461867,0.54641985852577557,0.55052499406260469,0.55451327713706422,0.55838962380398616,0.5621586783503375,0.56582483180653476,0.56939223896603519,0.69941472683080497,"I buck Diode avg"]
[null,"Ipk",{"$f":"IF(Topology=\"buck\",MAX(J187:BG187),MAX(J43:BG43))","v":0.76384380542954944},"Maximum peak inductor current, must be less than inductor saturation current",null,null,null,"I cout RMS",{"$f":"SQRT(((I102-I103/2-Iout_PreReg)^2+I103^2/12))","v":9.333832467109042E-2},{"$f":"SQRT(((J102-J103/2-Iout_PreReg)^2+J103^2/12))","v":1.321708792634595E-2},1.940902307107718E-2,2.514756343950101E-2,3.0480520715565219E-2,3.5449244015541892E-2,4.0287142239774948E-2,4.4618174998720582E-2,4.8680950804447405E-2,5.2499566233100529E-2,5.6095324954566497E-2,5.9487129654653623E-2,6.2691809983325963E-2,6.5724398347172627E-2,6.8598362942261182E-2,7.1325805543889564E-2,7.3917630101352674E-2,7.6383687031436012E-2,7.8732897191316764E-2,8.0973358785262808E-2,8.3112439878596886E-2,8.515685872530078E-2,8.7112753738177715E-2,8.8985744624003854E-2,9.07809859560883E-2,9.2503214251823562E-2,9.4156789454266185E-2,9.5745731577550217E-2,9.7273753160457943E-2,9.8744288076340003E-2,0.10016051716726079,0.10152539110291114,0.10284165080818984,{"$f":"SQRT(((AP102-AP103/2-Iout_PreReg)^2+AP103^2/12))","v":0.10411184575555753},0.10533835037780669,0.10652337882253794,0.10766899824038202,0.10877714077403028,0.10984961439375195,0.11088811270672028,0.11189422385167185,0.11286943857679593,0.11381515758696661,0.11473269823621615,0.11562330063247769,0.11648813321390077,0.11732829784930823,0.11814483450947383,0.11893872555074116,0.11971089964798287,0.12046223540991624,0.2993909018046767]
[null,"DCR <",{"$f":"ROUNDDOWN(0.033*Vout_sync_buck*Iout_sync_buck/C106^2*1000,0)","v":155},"Recommended inductor DC resistance",null,null,"Buck","Rds_On Buck",{"$f":"IF(I2>7,Buck_RdsON_factor_7V*(I89-150)+Rds_ON_150_7V,IF(I2<5,Buck_RdsON_factor_5V*(I89-150)+Rds_ON_150,Buck_RdsON_factor_6V*(I89-150)+Rds_ON_150_6V))","v":0.17412949151200519},{"$f":"IF(J87>7,Buck_RdsON_factor_7V*(J89-150)+Rds_ON_150_7V,IF(J87<5,Buck_RdsON_factor_5V*(J89-150)+Rds_ON_150,Buck_RdsON_factor_6V*(J89-150)+Rds_ON_150_6V))","v":0.18545009760466463},0.18544958107062257,0.18545721470515816,0.18547240208920238,0.18549463393801854,0.17253105203211533,0.17256988277671062,0.17261440373960982,0.17266434820260343,0.17271948194124395,0.17277959836073986,0.17284451448862781,0.17291406765194439,0.17298811270529107,0.17306651970532924,0.17314917194940324,0.17323596431297722,0.17332680183370017,0.17342159850013483,0.17352027621119887,0.17362276387869147,0.17372899665030261,0.17383891523451556,0.17395246531203989,0.17406959702101843,0.17419026450536912,0.17431442551735002,0.17444204106685379,0.17457307511110451,0.17470749427939558,0.17484526762831021,0.17498636642353438,{"$f":"IF(AP87>7,Buck_RdsON_factor_7V*(AP89-150)+Rds_ON_150_7V,IF(AP87<5,Buck_RdsON_factor_5V*(AP89-150)+Rds_ON_150,Buck_RdsON_factor_6V*(AP89-150)+Rds_ON_150_6V))","v":0.17513076394493257},0.17527843531202697,0.17542935732741788,0.17558350833601802,0.17574086809825898,0.17590141767566964,0.17606513932743389,0.17623201641671202,0.17640203332566226,0.17657517537822953,0.17675142876988242,0.17693078050357602,0.17711321833130383,0.17729873070067567,0.17748730670602186,0.1776789360435814,0.17787360897037974,0.17807131626644512,0.185216561767819,"Rds_On Buck","Buck"]
[null,"Lout =",4.7,"Enter select inductor value at total VREG current",null,null,null,"Conduction Losses",{"$f":"I105^2*I108","v":5.7111821483471263E-2},{"$f":"J105^2*J108","v":0.11840569493106272},{"$f":"K105^2*K108","v":0.11394474175069981},0.10982170885313725,0.10599890533004462,0.10244414675722381,9.2055836011977574E-2,8.9186427465870854E-2,8.6498110478608448E-2,8.3974093979166248E-2,8.1599632520135051E-2,7.9361720061078722E-2,7.7248837689834482E-2,7.5250744436033135E-2,7.3358302765717309E-2,7.1563332180708775E-2,6.9858485741394374E-2,6.8237145401141799E-2,6.6693332867044638E-2,6.5221633345136712E-2,6.3817130032687491E-2,6.2475347618355756E-2,6.1192203367236166E-2,5.9963964620540988E-2,5.8787211742748202E-2,5.7658805713144232E-2,5.657585969197166E-2,5.5535714000177427E-2,5.4535914040969871E-2,5.357419076488186E-2,5.2648443340833261E-2,5.1756723746191301E-2,5.0897223030947444E-2,5.0068259046385934E-2,4.9268265458245454E-2,4.8495781889347264E-2,4.7749445057789691E-2,4.702798079473558E-2,4.6330196841079342E-2,4.5654976335307768E-2,4.5001271916023031E-2,4.4368100372173529E-2,4.3754537782281118E-2,4.3159715091068196E-2,4.2582814078043707E-2,4.2023063677945352E-2,4.1479736617575244E-2,4.0952146337609671E-2,4.0439644171492255E-2,3.9941616756609177E-2,3.9457483655650924E-2,2.2814331857289358E-2,"Conduction Losses"]
[null,"Lout DCR",95,"Enter select inductor DC resistance",null,null,null,"Switching Losses",{"$f":"IF(I98=1,0,0.5*I87*Iout_PreReg*I96*10^3*(I87/SLEW_rate+I87/1.5)*10^-9)","v":0.21264747663551403},5.3161869158878508E-2,5.7590179792687643E-2,6.2195622851849118E-2,6.6978198336362996E-2,7.19379062462292E-2,7.7074746581447806E-2,8.2388719342018746E-2,8.787982452794206E-2,9.354806213921775E-2,9.93934321758458E-2,0.1054159346378262,0.11161556952515893,0.11799233683784405,0.12454623657588153,0.1312772687392714,0.13818543332801358,0.14527073034210819,0.1525331597815551,0.1599727216463544,0.16758941593650611,0.17538324265201014,0.18335420179286654,0.19150229335907526,0.19982751735063642,0.20832987376754986,0.21700936260981576,0.22586598387743392,0.23489973757040447,0.24411062368872749,0.25349864223240276,0.26306379320143047,{"$f":"IF(AO98=1,0,0.5*AO87*Iout_PreReg*AO96*10^3*(AO87/SLEW_rate+AO87/1.5)*10^-9)","v":0.27280607659581046},0.2827254924155429,0.29282204066062767,0.30309572133106477,0.31354653442685426,0.32417447994799609,0.3349795578944903,0.3459617682663369,0.35712111106353583,0.36845758628608716,0.37997119393399093,0.39166193400724708,0.40352980650585552,0.41557481142981645,0.42779694877912972,0.44019621855379526,0.4527726207538133,0.46552615537918351,0.47845682242990623,0.94492424719203694,"Switching Losses"]
[null,"Ripple",{"$f":"I44/Iout_sync_buck","v":0.18236125376184381},"Actual inductor ripple current at nominal input voltage",null,null,null,"Total Buck FET Losses",{"$f":"I109+I110","v":0.2697592981189853},{"$f":"J109+J110","v":0.17156756408994123},{"$f":"K109+K110","v":0.17153492154338745},0.17201733170498637,0.17297710366640762,0.174382053003453,0.16913058259342539,0.1715751468078896,0.17437793500655052,0.17752215611838401,0.18099306469598087,0.18477765469890492,0.18886440721499342,0.19324308127387718,0.19790453934159885,0.20284060091998019,0.20804391906940795,0.21350787574324998,0.21922649264859972,0.2251943549914911,0.23140654596919361,0.23785859027036588,0.2445464051601027,0.25146625797961625,0.25861472909338462,0.2659886794806941,0.27358522230178745,0.28140169787761138,0.28943565161137436,0.29768481445360934,0.306147085573236,0.31482051694762175,0.32370329962675792,0.33279375146192886,0.34209030611887314,0.35159150322041205,0.36129597948464398,0.37120246074273167,0.38130975473556966,0.39161674460164464,0.40212238297955888,0.41282568665826069,0.42372573171627204,0.43482164909831528,0.44611262058389922,0.45759787510776179,0.46927668539670497,0.48114836489140494,0.49321226492530557,0.50546777213579275,0.51791430608555711,0.96773857904932625,"Total Buck FET Losses"]
[null,null,null,null,null,null,"3V3 LDO","Output voltage",{"$f":"IF(I99-3.3<I113*Iout_3V3,I99-I113*Iout_3V3,3.3)","v":3.3},3.3,3.3,3.3,3.3,3.3,3.3,3.3,3.3,3.3,3.3,3.3,3.3,3.3,3.3,3.3,3.3,3.3,3.3,3.3,3.3,3.3,3.3,3.3,3.3,3.3,3.3,3.3,3.3,3.3,3.3,3.3,{"$f":"IF(AO99-3.3<AO113*Iout_3V3,AO99-AO113*Iout_3V3,3.3)","v":3.3},3.3,3.3,3.3,3.3,3.3,3.3,3.3,3.3,3.3,3.3,3.3,3.3,3.3,3.3,3.3,3.3,3.3,3.3,3.3,"Output voltage","5V0 LDO"]
[null,"Output Capacitor, Adjustable Buck",null,null,null,null,null,"Series pass resistance",{"$f":"(Rds_ON_3V3_150-Rds_ON_3V3_min40)/190*(I89-150)+Rds_ON_3V3_150","v":0.49274723821255351},0.49002319279114781,0.49002228721818525,0.49003567029166833,0.49006229638645071,0.49010127263884845,0.48995558579394705,0.49002340315170728,0.4901011583969449,0.49018838571000001,0.49028467602111847,0.49038966851535754,0.49050304363384334,0.49062451727049794,0.49075383593089245,0.49089077267078535,0.49103512367060448,0.49118670533180353,0.49134535180395139,0.49151091286926396,0.49168325212528224,0.49186224541744789,0.49204777948209949,0.49223975076742399,0.49243806440553278,0.49264263331338287,0.49285337740396168,0.49307022289217312,0.49329310168233448,0.49352195082623668,0.49375671204240279,0.49399733128858375,{"$f":"(Rds_ON_3V3_150-Rds_ON_3V3_min40)/190*(AO89-150)+Rds_ON_3V3_150","v":0.49424375838069812},0.4944959466523991,0.49475385265027677,0.49501743586039365,0.4952866584624398,0.49556148510828918,0.49584188272216412,0.4961278203199751,0.49641926884571186,0.49671620102302994,0.49701859122040248,0.49732641532840643,0.49763965064788279,0.49795827578785795,0.49828227057224228,0.49861161595443471,0.49894629393905937,0.49928628751014614,0.49963158056514195,0.51211065289562629,"Series pass resistance"]
[null,"Vripple",5.0000000000000001E-3,"Enter VREG maximum output switching frequency ripple",null,null,null,"Dropout",{"$f":"I99-I112","v":2.0499999999999998},{"$f":"J99-J112","v":2.0499999999999998},2.0499999999999998,2.0499999999999998,2.0499999999999998,2.0499999999999998,2.0499999999999998,2.0499999999999998,2.0499999999999998,2.0499999999999998,2.0499999999999998,2.0499999999999998,2.0499999999999998,2.0500000000000007,2.0499999999999998,2.0499999999999998,2.0499999999999998,2.0500000000000007,2.0499999999999998,2.0500000000000016,2.0499999999999998,2.0499999999999998,2.0500000000000007,2.0499999999999998,2.0499999999999998,2.0499999999999998,2.0499999999999989,2.0499999999999998,2.0499999999999998,2.0499999999999998,2.0499999999999998,2.0499999999999998,2.0500000000000007,2.0499999999999998,2.0500000000000007,2.0499999999999998,2.0499999999999998,2.0499999999999998,2.0499999999999989,2.0499999999999998,2.0499999999999989,2.0499999999999998,2.0499999999999998,2.0499999999999998,2.0499999999999998,2.0499999999999998,2.0499999999999998,2.0499999999999998,2.0499999999999998,2.0499999999999998,2.0499999999999998,2.0500000000000007,"Dropout"]
[null,"I Step",0.7,"Enter worst case transient load step",null,null,null,"Power dissipated",{"$f":"(I99-I112)*Iout_3V3","v":0},0,0,0,0,0,0,0,0,0,0,0,0,0,0,0,0,0,0,0,0,0,0,0,0,0,0,0,0,0,0,0,{"$f":"(AO99-AO112)*Iout_3V3","v":0},0,0,0,0,0,0,0,0,0,0,0,0,0,0,0,0,0,0,0,"Power dissipated"]
[null,"V transient",0.05,"Enter maximum ADJ Buck deviation due to load step",null,null,"Adj BUCK","V1",{"$f":"IF(Reset=1,Vreg-Vout_sync_buck,Vreg-Iout_sync_buck*(I128+DCR84*10^-3)-Vout_sync_buck)","v":1.8441093559415966},1.8452011663698205,1.8452015293277935,1.845196165327958,1.8451854934618739,1.8451698715935718,1.8452282635775195,1.8452010820563025,1.8451699173822727,1.8451349562581774,1.8450963626411294,1.8450542811474824,1.84500883985796,1.8449601526436386,1.8449083211062964,1.844853436206269,1.8447955796354174,1.8447348249809155,1.8446712387164101,1.8446048810499054,1.8445358066521607,1.8444640652849156,1.8443897023447882,1.844312759335839,1.8442332742815717,1.8441512820852868,1.8440668148462418,1.8439799021378551,1.8438905712532021,1.8437988474222271,1.8437047540044231,1.8436083126601828,{"$f":"IF(Reset=1,Vreg-Vout_sync_buck,Vreg-Iout_sync_buck*(AO128+DDX84*10^-3)-Vout_sync_buck)","v":1.8435095435035258},1.8434084652385474,1.8433050952815808,1.8431994498708075,1.8430915441647873,1.8429813923312182,1.8428690076270309,1.8427544024707965,1.8426375885083015,1.8425185766720364,1.8423973772352396,1.8422739998610824,1.8421484536474964,1.8420207471680872,1.8418908885095266,1.8417588853057847,1.8416247447694927,1.8414884737207338,1.8413500786134884,1.8363484067625269]
[null,"VIN min for transient",5.25,"Minimum input voltage for load transient spec",null,null,null,"V3",{"$f":"IF(Reset=1,Vout_sync_buck,Vout_sync_buck+Iout_sync_buck*(I132+dcr_2*10^-3))","v":3.4393906440584034},3.4382988336301792,3.4382984706722066,3.4383038346720411,3.4383145065381262,3.4383301284064278,3.4382717364224806,3.4382989179436971,3.4383300826177265,3.4383650437418223,3.4384036373588707,3.4384457188525177,3.4384911601420391,3.4385398473563611,3.4385916788937037,3.4386465637937302,3.4387044203645822,3.4387651750190837,3.4388287612835899,3.4388951189500943,3.438964193347839,3.4390359347150836,3.4391102976552115,3.4391872406641606,3.4392667257184275,3.4393487179147129,3.4394331851537583,3.439520097862145,3.4396094287467975,3.439701152577773,3.439795245995577,3.4398916873398169,{"$f":"IF(Reset=1,Vout_sync_buck,Vout_sync_buck+Iout_sync_buck*(AO132+dcr_2*10^-3))","v":3.4399904564964738},3.4400915347614527,3.4401949047184188,3.4403005501291926,3.4404084558352124,3.440518607668781,3.4406309923729688,3.4407455975292036,3.4408624114916981,3.4409814233279632,3.4411026227647605,3.4412260001389177,3.4413515463525028,3.4414792528319125,3.4416091114904726,3.441741114694215,3.441875255230507,3.4420115262792654,3.4421499213865112,3.4471515932374732]
[null,"Output Capacitor",{"$f":"ROUNDUP(MAX(Y166:Y168),0)","v":15},"Minimum output capacitance required",null,null,null,"Required Buck duty",{"$f":"IF(Reset=1,Vout_sync_buck/Vreg,I117/(I116+I117))","v":0.65096823016152239},0.65076158486423374,0.65076151616773092,0.65076253140381224,0.65076455125165633,0.65076750797888294,0.65075645621699263,0.65076160082212497,0.6507674993125252,0.6507741163512486,0.65078142090638225,0.65078938560660882,0.65079798621028484,0.65080720116520507,0.65081701124135583,0.65082739922281263,0.65083834964788156,0.65084984858883022,0.65086188346429263,0.65087444287879137,0.65088751648487531,0.65090109486421577,0.65091516942466388,0.65092973231080919,0.65094477632600134,0.65096029486414553,0.65097628184986434,0.65099273168584171,0.6510096392063589,0.65102699963618305,0.65104480855409808,0.65106306186047447,{"$f":"IF(Reset=1,Vout_sync_buck/Vreg,AO117/(AO116+AO117))","v":0.65108175574836258},0.65110088667766686,0.65112045135202401,0.65114044669805859,0.65116086984673271,0.65118171811654801,0.65120298899838525,0.65122468014180057,0.65124678934261349,0.65126931453164816,0.65129225376450472,0.65131560521224896,0.65133936715292962,0.65136353796383317,0.65138811611440772,0.65141310015978326,0.65143848873483612,0.65146428054873962,0.65149047437995855,0.65243713319532004]
[null,"ESR",{"$f":"ROUNDUP(C114/(2*C120)*1000,0)","v":68},"Maximum series equivalent resistance for output capacitor",null,null,null,"ton buck",{"$f":"I118/(fsw*10^3)*10^6","v":0.32548411508076119},0.32538079243211687,0.32538075808386546,0.32538126570190612,0.32538227562582817,0.32538375398944147,0.32537822810849631,0.32538080041106249,0.3253837496562626,0.3253870581756243,0.32539071045319112,0.32539469280330441,0.32539899310514242,0.32540360058260254,0.32540850562067791,0.32541369961140632,0.32541917482394078,0.32542492429441511,0.32543094173214632,0.32543722143939569,0.32544375824243765,0.32545054743210788,0.32545758471233194,0.3254648661554046,0.32547238816300067,0.32548014743207276,0.32548814092493217,0.32549636584292085,0.32550481960317945,0.32551349981809152,0.32552240427704904,0.32553153093023723,{"$f":"AO118/(fsw*10^3)*10^6","v":0.32554087787418129},0.32555044333883343,0.32556022567601201,0.3255702233490293,0.32558043492336636,0.32559085905827401,0.32560149449919262,0.32561234007090029,0.32562339467130674,0.32563465726582408,0.32564612688225236,0.32565780260612448,0.32566968357646481,0.32568176898191659,0.32569405805720386,0.32570655007989163,0.32571924436741806,0.32573214027436981,0.32574523718997928,0.32621856659766002]
[null,"I RMS",{"$f":"ROUNDUP(IF(Topology=\"Buck\",MAX(J195:BG195),MAX(J48:BG48)),3)","v":3.6999999999999998E-2},"Maximum RMS current in output capacitor",null,null,null,"toff buck",{"$f":"1/(fsw*10^-3)-I119","v":0.17451588491923881},0.17461920756788313,0.17461924191613454,0.17461873429809388,0.17461772437417183,0.17461624601055853,0.17462177189150369,0.17461919958893751,0.1746162503437374,0.1746129418243757,0.17460928954680888,0.17460530719669559,0.17460100689485758,0.17459639941739746,0.17459149437932209,0.17458630038859368,0.17458082517605922,0.17457507570558489,0.17456905826785368,0.17456277856060431,0.17455624175756235,0.17454945256789212,0.17454241528766806,0.1745351338445954,0.17452761183699933,0.17451985256792724,0.17451185907506783,0.17450363415707915,0.17449518039682055,0.17448650018190848,0.17447759572295096,0.17446846906976277,{"$f":"1/(fsw*10^-3)-AO119","v":0.17445912212581871},0.17444955666116657,0.17443977432398799,0.1744297766509707,0.17441956507663364,0.17440914094172599,0.17439850550080738,0.17438765992909971,0.17437660532869326,0.17436534273417592,0.17435387311774764,0.17434219739387552,0.17433031642353519,0.17431823101808341,0.17430594194279614,0.17429344992010837,0.17428075563258194,0.17426785972563019,0.17425476281002072,0.17378143340233998]
[null,"Actual Capacitor value =",8.5,"Enter minimum capacitance value of ceramic capacitor with tolerance & DC bias",null,null,null,"VREG_actual",{"$f":"I116*I118/(1-I118)-Iout_sync_buck*(I132+dcr_2*10^-3)","v":3.3},3.2999999999999985,3.2999999999999994,3.3000000000000007,3.3000000000000003,3.3,3.3,3.3,3.2999999999999989,3.299999999999998,3.3,3.3,3.3000000000000003,3.2999999999999985,3.3,3.2999999999999994,3.2999999999999989,3.3000000000000003,3.3000000000000003,3.2999999999999989,3.2999999999999985,3.2999999999999989,3.2999999999999994,3.2999999999999985,3.3,3.2999999999999994,3.3000000000000003,3.2999999999999994,3.2999999999999985,3.3000000000000007,3.3000000000000007,3.2999999999999989,{"$f":"AO116*AO118/(1-AO118)-Iout_sync_buck*(AO132+dcr_2*10^-3)","v":3.2999999999999989},3.3000000000000003,3.2999999999999994,3.3,3.2999999999999985,3.2999999999999994,3.299999999999998,3.2999999999999989,3.2999999999999994,3.2999999999999989,3.3000000000000003,3.2999999999999989,3.3000000000000007,3.2999999999999994,3.3,3.2999999999999989,3.299999999999998,3.2999999999999989,3.2999999999999985,3.3000000000000007]
[null,"Estimated ESR",3,"Enter estimated equivalent series resistance of output capacitor used",null,null,null,"Ilpk",{"$f":"Iout_sync_buck+I123/2","v":0.76385407466285138},0.76387159762873169,0.7638716034500197,0.76387151741943771,0.76387134625685005,0.7638710956986523,0.7638720322189968,0.76387159627647216,0.76387109643306172,0.76387053567594221,0.76386991662706338,0.76386924159780922,0.76386851263402833,0.76386773155336884,0.76386689997642054,0.76386601935284015,0.76386509098338407,0.76386411603858351,0.76386309557464738,0.76386203054706681,0.76386092182230059,0.76385977018785389,0.76385857636100329,0.76385734099637692,0.76385606469256306,0.76385474799788988,0.76385339141549613,0.76385199540779325,0.76385056040040178,0.76384908678563535,0.76384757492558986,0.76384602515489153,{"$f":"Iout_sync_buck+AO123/2","v":0.76384443778314559},0.76384281309712421,0.7638411513627249,0.76383945282672827,0.76383771771837761,0.76383594625080153,0.76383413862229843,0.76383229501749672,0.7638304156084067,0.76382850055537366,0.76382655000794419,0.7638245641056548,0.76382254297875041,0.76382048674883973,0.76381839552949538,0.76381626942680148,0.76381410853985721,0.76381191296123796,0.7638096827774189,0.76372882393914554]
[null,"Number of capacitors =",2,"Enter the number of parallel ceramic capacitors",null,null,null,"ΔIL",{"$f":"I116*I118/(L_buck2*10^-6*fsw*10^3)","v":0.12770814932570276},0.1277431952574635,0.12774320690003943,0.12774303483887545,0.12774269251370027,0.12774219139730469,0.12774406443799377,0.12774319255294431,0.12774219286612343,0.12774107135188456,0.12773983325412677,0.12773848319561842,0.12773702526805683,0.12773546310673786,0.1277337999528412,0.12773203870568034,0.1277301819667683,0.12772823207716713,0.12772619114929493,0.12772406109413365,0.12772184364460118,0.12771954037570785,0.12771715272200673,0.12771468199275399,0.12771212938512624,0.12770949599577983,0.12770678283099243,0.12770399081558653,0.12770112080080362,0.12769817357127075,0.1276951498511798,0.12769205030978312,0.12768887556629127,0.12768562619424842,0.12768230272544984,0.12767890565345674,0.12767543543675539,0.12767189250160324,0.12766827724459684,0.12766459003499353,0.12766083121681351,0.12765700111074735,0.12765310001588845,0.12764912821130972,0.12764508595750088,0.12764097349767964,0.12763679105899076,0.12763253885360296,0.12762821707971453,0.12762382592247601,0.1276193655548378,0.12745764787829111]
[null,null,null,null,null,null,null,"IL RMS",{"$f":"SQRT((I122-I123/2)^2+I123^2/12)","v":0.70097012367409994},{"$f":"SQRT((J122-J123/2)^2+J123^2/12)","v":0.70097065582510809},0.70097065600191766,0.7009706533889184,0.70097064819022259,0.70097064058008074,0.70097066902493255,0.70097065578403606,0.70097064060238667,0.7009706235707579,0.70097060476883233,0.70097058426686232,0.70097056212703701,0.70097053840461632,0.7009705131488766,0.70097048640390391,0.70097045820926385,0.70097042860056735,0.70097039760995528,0.70097036526651024,0.70097033159661226,0.70097029662424482,0.70097026037125942,0.70097022285760646,0.70097018410153522,0.7009701441197701,0.70097010292766415,0.70097006053933497,0.70097001696778372,0.70096997222500179,0.70096992632206379,0.7009698792692115,0.70096983107592814,0.70096978175100488,0.7009697313026001,0.70096967973829316,0.70096962706513211,0.70096957328967691,0.70096951841803856,0.70096946245591429,0.70096940540861974,0.70096934728111737,0.70096928807804326,0.70096922780373094,0.70096916646223328,0.70096910405734214,0.70096904059260678,0.70096897607135078,0.70096891049668686,0.70096884387153102,0.70096877619861564,0.70096632420315941]
[null," Compensation Components, Adjustable Buck:",null,null,null,null,null,"I_hi_sw buck RMS",{"$f":"SQRT(I118*((I122-I123/2)^2+I123^2/12))","v":0.56556093659214324},0.56547159207659681,0.56547156237272067,0.5654720013533695,0.56547287471972285,0.5654741531828068,0.56546937448171686,0.56547159897667454,0.56547414943555374,0.56547701057442434,0.5654801689705603,0.5654836127838222,0.56548733152711528,0.56549131587605339,0.56549555751017777,0.56550004897974648,0.56550478359338052,0.56550975532282788,0.56551495872185209,0.56552038885684652,0.56552604124722594,0.56553191181401463,0.56553799683533634,0.56554429290774066,0.56555079691248666,0.56555750598605137,0.56556441749425701,0.56557152900950203,0.56557883829067057,0.56558634326535606,0.5655940420140918,0.56560193275632764,0.56561001383793141,0.5656182837200211,0.56562674096896692,0.56563538424742132,0.56564421230625439,0.5656532239772899,0.56566241816675011,0.56567179384933008,0.56568135006283005,0.56569108590328721,0.56570100052055305,0.56571109311426693,0.56572136293018771,0.56573180925684552,0.56574243142248104,0.56575322879224355,0.56576420076562495,0.56577534677410246,0.56578666627897511,0.56619559924998264]
[null,"fcMAX",{"$f":"ROUNDDOWN(fsw/22,0)","v":90},"Recommended maximum 0dB crossover frequency",null,null,null,"I_lo_sw buck RMS",{"$f":"SQRT((1-I118)*((I122-I123/2)^2+I123^2/12))","v":0.41412551392627411},{"$f":"SQRT((1-J118)*((J122-J123/2)^2+J123^2/12))","v":0.4142484023894854},0.41424844323607679,0.414247839581454,0.41424663858676436,0.41424488052049152,0.41425145184599815,0.41424839290100385,0.4142448856735077,0.41424095116367904,0.41423660781129557,0.41423187187900284,0.41422675776805712,0.41422127828013283,0.41421544483571887,0.41420926765734017,0.41420275592408734,0.41419591790260141,0.4141887610586274,0.41418129215244121,0.41417351732082719,0.41416544214778145,0.41415707172572386,0.41414841070868069,0.41413946335865109,0.41413023358616152,0.41412072498584501,0.41411094086774974,0.41410088428496566,0.41409055805806849,0.4140799647968027,0.41406910691936388,0.4140579866695851,0.41404660613229172,0.41403496724704858,0.41402307182049325,0.41401092153742441,0.41399851797078885,0.4139858625906947,0.41397295677255841,0.41395980180448427,0.41394639889395757,0.41393274917392558,0.4139188537083327,0.41390471349716329,0.4138903294810462,0.41387570254546119,0.41386083352459113,0.41384572320485064,0.41383037232812536,0.41381478159474749,0.4132509298922894]
[null,"fc =",45,"Choose fc considering recommended fcMAX",null,null,null,"I cout RMS",{"$f":"SQRT(((I122-I123/2-Iout_sync_buck)^2+I123^2/12))","v":3.6866167195451709E-2},3.6876284084519741E-2,3.6876287445441913E-2,3.6876237775662242E-2,3.687613895489622E-2,3.6875994295053283E-2,3.6876534995326296E-2,3.68762833037923E-2,3.6875994719064727E-2,3.687567096579087E-2,3.6875313557753996E-2,3.6874923829432395E-2,3.6874502961997319E-2,3.6874052004868312E-2,3.6873571893693335E-2,3.6873063465432121E-2,3.6872527471076777E-2,3.6871964586433721E-2,3.6871375421305509E-2,3.6870760527345135E-2,3.6870120404802892E-2,3.6869455508345098E-2,3.6868766252091567E-2,3.6868053013991986E-2,3.6867316139641476E-2,3.6866555945617455E-2,3.6865772722407278E-2,3.6864966736984188E-2,3.6864138235080446E-2,3.6863287443198361E-2,3.6862414570394131E-2,3.6861519809864261E-2,3.6860603340359448E-2,3.6859665327447624E-2,3.6858705924644873E-2,3.6857725274430035E-2,3.6856723509156704E-2,3.6855700751874797E-2,3.6854657117071879E-2,3.6853592711343364E-2,3.6852507633999332E-2,3.6851401977615168E-2,3.685027582853171E-2,3.6849129267310363E-2,3.684796236914803E-2,3.6846775204255618E-2,3.6845567838204168E-2,3.6844340332241515E-2,3.6843092743582585E-2,3.6841825125675728E-2,3.6840537528447424E-2,3.6793853656403953E-2]
[null,"R_LOADTYP",{"$f":"Vout_sync_buck/Iout_sync_buck","v":4.7142857142857144},null,null,null,"Adj BUCK High Side FET","Rds_On Buck",{"$f":"Buck_RdsON_factor_7V*(I89-150)+Adj_buck_hi_rdsON_150","v":0.29412949151200518},0.29256976232882781,0.2925692438174381,0.29257690667434499,0.29259215219732337,0.29261446915203998,0.29253105203211532,0.29256988277671059,0.29261440373960984,0.2926643482026034,0.29271948194124392,0.29277959836073986,0.29284451448862781,0.29291406765194439,0.29298811270529107,0.29306651970532921,0.29314917194940321,0.29323596431297722,0.29332680183370013,0.29342159850013483,0.29352027621119886,0.29362276387869146,0.29372899665030261,0.29383891523451555,0.29395246531203989,0.29406959702101843,0.29419026450536911,0.29431442551734999,0.29444204106685379,0.29457307511110453,0.29470749427939558,0.2948452676283102,{"$f":"Buck_RdsON_factor_7V*(AO89-150)+Adj_buck_hi_rdsON_150","v":0.29498636642353437},0.29513076394493254,0.29527843531202697,0.29542935732741787,0.29558350833601799,0.295740868098259,0.29590141767566963,0.29606513932743389,0.29623201641671204,0.29640203332566223,0.29657517537822953,0.29675142876988242,0.29693078050357602,0.29711321833130383,0.2972987307006757,0.29748730670602186,0.29767893604358142,0.29787360897037973,0.29807131626644512,0.30521656176781897,null,"V5 LDO"]
[null,"fP1",{"$f":"wp_adj/(2*PI())","v":2.4098265434380255},"Dominant pole formed by Co and RLOAD.",null,null,null,"Conduction Losses",{"$f":"I125^2*I128","v":9.4080015909641143E-2},{"$f":"J125^2*J128","v":9.3551557594063667E-2},9.3551381967441477E-2,9.3553977481329043E-2,9.3559141369986817E-2,9.3566700513536646E-2,9.3538446003526399E-2,9.355159839134955E-2,9.3566678357106331E-2,9.3583595654955082E-2,9.3602271050659658E-2,9.3622634673356311E-2,9.3644624657698697E-2,9.3668186017981769E-2,9.3693269708957971E-2,9.3719831837938111E-2,9.3747833000282582E-2,9.3777237716146919E-2,9.3808013950794911E-2,9.3840132704258949E-2,9.3873567658841042E-2,9.3908294875092987E-2,9.394429252861651E-2,9.3981540681384104E-2,9.4020021082375435E-2,9.4059716993206144E-2,9.4100613035145608E-2,9.4142695054502706E-2,9.418595000384189E-2,9.4230365836885252E-2,9.4275931415284425E-2,9.432263642571799E-2,9.4370471305996809E-2,9.4419427179048318E-2,9.4469495793812447E-2,9.4520669472213978E-2,9.4572941061491389E-2,9.4626303891257965E-2,9.4680751734753002E-2,9.4736278773812202E-2,9.4792879567144037E-2,9.4850549021553196E-2,9.4909282365794795E-2,9.4969075126780989E-2,9.5029923107896666E-2,9.5091822369207907E-2,9.5154769209372339E-2,9.5218760149082149E-2,9.5283791915890925E-2,9.5349861430288854E-2,9.541696579290955E-2,9.7845549086790704E-2]
[null,"fZ1",{"$f":"wz_adj/(2*PI())","v":6241.3703173292288},"Zero formed by the output capacitance and its ESR",null,null,null,"Switching Losses",{"$f":"0.5*Vreg*Iout_sync_buck*fsw*10^3*(Vreg/SLEW_rate+Vreg/1.5)*10^-9","v":3.5619111111111101E-2},3.5619111111111101E-2,3.5619111111111101E-2,3.5619111111111101E-2,3.5619111111111101E-2,3.5619111111111101E-2,3.5619111111111101E-2,3.5619111111111101E-2,3.5619111111111101E-2,3.5619111111111101E-2,3.5619111111111101E-2,3.5619111111111101E-2,3.5619111111111101E-2,3.5619111111111101E-2,3.5619111111111101E-2,3.5619111111111101E-2,3.5619111111111101E-2,3.5619111111111101E-2,3.5619111111111101E-2,3.5619111111111101E-2,3.5619111111111101E-2,3.5619111111111101E-2,3.5619111111111101E-2,3.5619111111111101E-2,3.5619111111111101E-2,3.5619111111111101E-2,3.5619111111111101E-2,3.5619111111111101E-2,3.5619111111111101E-2,3.5619111111111101E-2,3.5619111111111101E-2,3.5619111111111101E-2,3.5619111111111101E-2,3.5619111111111101E-2,3.5619111111111101E-2,3.5619111111111101E-2,3.5619111111111101E-2,3.5619111111111101E-2,3.5619111111111101E-2,3.5619111111111101E-2,3.5619111111111101E-2,3.5619111111111101E-2,3.5619111111111101E-2,3.5619111111111101E-2,3.5619111111111101E-2,3.5619111111111101E-2,3.5619111111111101E-2,3.5619111111111101E-2,3.5619111111111101E-2,3.5619111111111101E-2,3.5619111111111101E-2,3.5619111111111101E-2]
[null,"fP2",{"$f":"IF(fz_1_2>10*fc_2,MAX(fsw/2,5*fc_2),fz_1_2)","v":1000},null,null,null,null,"Total Buck FET Losses",{"$f":"I129+I130","v":0.12969912702075226},{"$f":"J129+J130","v":0.12917066870517477},0.12917049307855258,0.12917308859244014,0.12917825248109793,0.12918581162464776,0.1291575571146375,0.12917070950246065,0.12918578946821743,0.12920270676606618,0.12922138216177076,0.1292417457844674,0.12926373576880978,0.12928729712909287,0.12931238082006907,0.12933894294904921,0.12936694411139368,0.12939634882725803,0.12942712506190601,0.12945924381537005,0.12949267876995213,0.1295274059862041,0.12956340363972763,0.12960065179249519,0.12963913219348655,0.12967882810431725,0.12971972414625671,0.12976180616561381,0.12980506111495299,0.12984947694799637,0.12989504252639553,0.12994174753682908,0.1299895824171079,0.13003853829015943,0.13008860690492355,0.13013978058332509,0.13019205217260249,0.13024541500236908,0.13029986284586409,0.13035538988492329,0.13041199067825515,0.13046966013266431,0.1305283934769059,0.13058818623789209,0.13064903421900775,0.13071093348031901,0.13077388032048343,0.13083787126019325,0.13090290302700203,0.13096897254139994,0.13103607690402064,0.13346466019790182]
[null,"Rz",{"$f":"fc_2*10^3*Vout_sync_buck/VFB_adj*2*PI()*Number_Cout2*Co_2*10^-6/(gm_POWER2*gm_EA2*10^-6)*10^-3","v":10.574600871983241},"Recommended compensation resister to achieve chosen fc",null,null,"Adj BUCK Low Side FET","Rds_On Buck",{"$f":"Buck_RdsON_factor_7V*(I89-150)+Adj_buck_lo_rdsON_150","v":0.10412949151200518},0.10256976232882783,0.10256924381743809,0.10257690667434499,0.10259215219732336,0.10261446915204002,0.10253105203211532,0.10256988277671063,0.10261440373960984,0.10266434820260342,0.10271948194124396,0.10277959836073988,0.10284451448862782,0.10291406765194441,0.10298811270529108,0.10306651970532923,0.10314917194940325,0.10323596431297723,0.10332680183370017,0.10342159850013485,0.10352027621119887,0.10362276387869147,0.10372899665030264,0.10383891523451558,0.10395246531203989,0.10406959702101845,0.10419026450536911,0.10431442551735001,0.1044420410668538,0.10457307511110452,0.10470749427939559,0.1048452676283102,{"$f":"Buck_RdsON_factor_7V*(AO89-150)+Adj_buck_lo_rdsON_150","v":0.10498636642353439},0.10513076394493258,0.10527843531202699,0.10542935732741789,0.10558350833601803,0.105740868098259,0.10590141767566964,0.10606513932743389,0.10623201641671204,0.10640203332566225,0.10657517537822954,0.10675142876988243,0.10693078050357602,0.10711321833130384,0.10729873070067568,0.10748730670602186,0.10767893604358141,0.10787360897037974,0.10807131626644513,0.115216561767819,null,"Buck Diode"]
[null,"Actual Rz used = ",10,"Enter the closest available 1% standard resister value",null,null,null,"Conduction Losses",{"$f":"I126^2*I132","v":1.7858201680314621E-2},{"$f":"J126^2*J132","v":1.7601149572365034E-2},1.7601064065982615E-2,1.7602327724473833E-2,1.7604841794634753E-2,1.7608521927872441E-2,1.7594765860202002E-2,1.7601169435111211E-2,1.7608511141260125E-2,1.7616746898935953E-2,1.7625837981302551E-2,1.7635750212974817E-2,1.7646453309705358E-2,1.7657920330819182E-2,1.7670127222396328E-2,1.7683052434000562E-2,1.7696676595399665E-2,1.7710982242520008E-2,1.7725953584039937E-2,1.7741576301709139E-2,1.775783737880109E-2,1.7774724952147016E-2,1.7792228184027509E-2,1.7810337150858651E-2,1.7829042746141444E-2,1.7848336595572341E-2,1.7868210982561462E-2,1.7888658782690119E-2,1.7909673405872302E-2,1.7931248745177441E-2,1.7953379131430736E-2,1.7976059292839651E-2,1.7999284319005243E-2,1.8023049628769577E-2,1.8047350941427735E-2,1.8072184250898477E-2,1.8097545802502956E-2,1.8123432072047634E-2,1.8149839746947793E-2,1.8176765709161744E-2,1.8204207019735547E-2,1.8232160904782673E-2,1.8260624742744865E-2,1.8289596052799121E-2,1.8319072484291637E-2,1.8349051807093817E-2,1.8379531902787169E-2,1.8410510756595194E-2,1.8441986449988779E-2,1.8473957153900385E-2,1.8506421122489024E-2,1.9676261695692129E-2]
[null,"Cz (min)",{"$f":"MIN(4*1000000000/(6.28*Rz_adj*1000*fc_2*1000),1000000000/(6.28*Rz_adj*1000*1.5*fp_1_2*1000))","v":1.4154281670205235},"Recommended range for the compensation capacitor",null,null,null,"Body Diode Losses",{"$f":"(I122-I123/2)*(2*td*10^-9*(fsw*10^3))*0.05","v":2.1000000000000003E-3},2.1000000000000003E-3,2.1000000000000003E-3,2.1000000000000003E-3,2.1000000000000003E-3,2.1000000000000003E-3,2.1000000000000003E-3,2.1000000000000003E-3,2.1000000000000003E-3,2.1000000000000003E-3,2.1000000000000003E-3,2.1000000000000003E-3,2.1000000000000003E-3,2.1000000000000003E-3,2.1000000000000003E-3,2.1000000000000003E-3,2.1000000000000003E-3,2.1000000000000003E-3,2.1000000000000003E-3,2.1000000000000003E-3,2.1000000000000003E-3,2.1000000000000003E-3,2.1000000000000003E-3,2.1000000000000003E-3,2.1000000000000003E-3,2.1000000000000003E-3,2.1000000000000003E-3,2.1000000000000003E-3,2.1000000000000003E-3,2.1000000000000003E-3,2.1000000000000003E-3,2.1000000000000003E-3,{"$f":"(AO122-AO123/2)*(2*td*10^-9*(fsw*10^3))*0.05","v":2.1000000000000003E-3},2.1000000000000003E-3,2.1000000000000003E-3,2.1000000000000003E-3,2.1000000000000003E-3,2.1000000000000003E-3,2.1000000000000003E-3,2.1000000000000003E-3,2.1000000000000003E-3,2.1000000000000003E-3,2.1000000000000003E-3,2.1000000000000003E-3,2.1000000000000003E-3,2.1000000000000003E-3,2.1000000000000003E-3,2.1000000000000003E-3,2.1000000000000003E-3,2.1000000000000003E-3,2.1000000000000003E-3,2.1000000000000003E-3]
[null,"Cz (max)",{"$f":"MAX(4*1000000000/(6.28*Rz_adj*1000*fc_2*1000),1000000000/(6.28*Rz_adj*1000*1.5*fp_1_2*1000))","v":4.4051764976863508},null,null,null,null,"Total Buck FET Losses",{"$f":"I133+I134","v":1.9958201680314622E-2},{"$f":"J133+J134","v":1.9701149572365035E-2},1.9701064065982616E-2,1.9702327724473834E-2,1.9704841794634755E-2,1.9708521927872442E-2,1.9694765860202003E-2,1.9701169435111212E-2,1.9708511141260127E-2,1.9716746898935954E-2,1.9725837981302553E-2,1.9735750212974818E-2,1.9746453309705359E-2,1.9757920330819183E-2,1.9770127222396329E-2,1.9783052434000564E-2,1.9796676595399666E-2,1.9810982242520009E-2,1.9825953584039938E-2,1.984157630170914E-2,1.9857837378801091E-2,1.9874724952147017E-2,1.989222818402751E-2,1.9910337150858652E-2,1.9929042746141445E-2,1.9948336595572342E-2,1.9968210982561463E-2,1.998865878269012E-2,2.0009673405872303E-2,2.0031248745177442E-2,2.0053379131430737E-2,2.0076059292839652E-2,2.0099284319005244E-2,2.0123049628769579E-2,2.0147350941427736E-2,2.0172184250898478E-2,2.0197545802502957E-2,2.0223432072047635E-2,2.0249839746947794E-2,2.0276765709161745E-2,2.0304207019735548E-2,2.0332160904782674E-2,2.0360624742744866E-2,2.0389596052799122E-2,2.0419072484291638E-2,2.0449051807093818E-2,2.047953190278717E-2,2.0510510756595195E-2,2.0541986449988781E-2,2.0573957153900386E-2,2.0606421122489026E-2,2.1776261695692131E-2]
[null,"Cp",{"$f":"MAX(1/(2*PI()*Rz_adj*10^3*fz_1_2*10^3)*10^12, 1/(2*PI()*Rz_adj*10^3*fsw/2*10^3)*10^12, 1/(2*PI()*Rz_adj*10^3*15*fc_2*10^3)*10^12)","v":23.578510087688201},"Recommended HF compensation capacitor",null,null,"V5A LDO","Output voltage",{"$f":"IF(I99-5<I137*Iout_V5A,I99-I137*Iout_V5A,5)","v":5},5,5,5,5,5,5,5,5,5,5,5,5,5,5,5,5,5,5,5,5,5,5,5,5,5,5,5,5,5,5,5,{"$f":"IF(AO99-5<AO137*Iout_V5A,AO99-AO137*Iout_V5A,5)","v":5},5,5,5,5,5,5,5,5,5,5,5,5,5,5,5,5,5,5,5]
[null,"Actual Cz used =",1.5,"Enter actual Cp used",null,null,null,"Series pass resistance",{"$f":"(Rds_ON_V5A_150-Rds_ON_V5A_min40)/190*(I89-150)+Rds_ON_V5A_150","v":0.67222727883847211},0.66511406290596808,0.66511169821117466,0.6651466450188811,0.66521617292033908,0.66531795040810271,0.66493752283587315,0.66511461221401991,0.66531765209173765,0.66554542608849176,0.66579686601302879,0.66607102968039855,0.66636708263635347,0.66668428300344018,0.66702196883946185,0.66737954753190842,0.66775648685300693,0.66815230737752673,0.66856657602534375,0.66899890053738353,0.66944892473010509,0.66991632440253324,0.67040080379275602,0.67090209249911281,0.67141994279600703,0.67195412728616988,0.67250443684085148,0.67307067878730231,0.6736526753093629,0.67425026203231297,0.67486328676752638,0.67549160839614242,{"$f":"(Rds_ON_V5A_150-Rds_ON_V5A_min40)/190*(AO89-150)+Rds_ON_V5A_150","v":0.6761350958740141},0.67679362734274728,0.67746708933379041,0.67815537605434606,0.67885838874540327,0.67957603510348918,0.680308228758844,0.6810548888036686,0.68181593936489804,0.68259130921665412,0.68338093142811984,0.68418474304310106,0.6850026847879831,0.68583470080517484,0.68668073840947497,0.68754074786508046,0.68841468218122048,0.68930249692461609,0.69020415004716629,0.72279036737913116]
[null,"Actual Cp used =",27,"Enter actual Cz used",null,null,null,"Dropout",{"$f":"I99-I136","v":0.34999999999999964},0.34999999999999964,0.34999999999999964,0.34999999999999964,0.34999999999999964,0.34999999999999964,0.34999999999999964,0.34999999999999964,0.34999999999999964,0.34999999999999964,0.34999999999999964,0.34999999999999964,0.34999999999999964,0.35000000000000053,0.34999999999999964,0.34999999999999964,0.34999999999999964,0.35000000000000053,0.34999999999999964,0.35000000000000142,0.34999999999999964,0.34999999999999964,0.35000000000000053,0.34999999999999964,0.34999999999999964,0.34999999999999964,0.34999999999999876,0.34999999999999964,0.34999999999999964,0.34999999999999964,0.34999999999999964,0.34999999999999964,{"$f":"AO99-AO136","v":0.35000000000000053},0.34999999999999964,0.35000000000000053,0.34999999999999964,0.34999999999999964,0.34999999999999964,0.34999999999999876,0.34999999999999964,0.34999999999999876,0.34999999999999964,0.34999999999999964,0.34999999999999964,0.34999999999999964,0.34999999999999964,0.34999999999999964,0.34999999999999964,0.34999999999999964,0.34999999999999964,0.34999999999999964,0.35000000000000053]
[null,"Estimated cross over",{"$f":"'Control Loop2'!$B$21","v":42.292428743894995},null,null,null,null,"Power dissipated",{"$f":"(I99-I136)*Iout_V5A","v":0},0,0,0,0,0,0,0,0,0,0,0,0,0,0,0,0,0,0,0,0,0,0,0,0,0,0,0,0,0,0,0,{"$f":"(AO99-AO136)*Iout_V5A","v":0},0,0,0,0,0,0,0,0,0,0,0,0,0,0,0,0,0,0,0]
[null,"Estimated phase margin",{"$f":"'Control Loop2'!$B$22","v":68.875938047846844},null,null,null,"V5B LDO","Output voltage",{"$f":"IF(I99-5<I141*Iout_V5B,I99-I141*Iout_V5B,5)","v":5},5,5,5,5,5,5,5,5,5,5,5,5,5,5,5,5,5,5,5,5,5,5,5,5,5,5,5,5,5,5,5,{"$f":"IF(AO99-5<AO141*Iout_V5B,AO99-AO141*Iout_V5B,5)","v":5},5,5,5,5,5,5,5,5,5,5,5,5,5,5,5,5,5,5,5]
[null,null,null,null,null,null,null,"Series pass resistance",{"$f":"(Rds_ON_V5B_150-Rds_ON_V5B_min40)/190*(I89-150)+Rds_ON_V5B_150","v":0.67222727883847211},0.66511406290596808,0.66511169821117466,0.6651466450188811,0.66521617292033908,0.66531795040810271,0.66493752283587315,0.66511461221401991,0.66531765209173765,0.66554542608849176,0.66579686601302879,0.66607102968039855,0.66636708263635347,0.66668428300344018,0.66702196883946185,0.66737954753190842,0.66775648685300693,0.66815230737752673,0.66856657602534375,0.66899890053738353,0.66944892473010509,0.66991632440253324,0.67040080379275602,0.67090209249911281,0.67141994279600703,0.67195412728616988,0.67250443684085148,0.67307067878730231,0.6736526753093629,0.67425026203231297,0.67486328676752638,0.67549160839614242,{"$f":"(Rds_ON_V5B_150-Rds_ON_V5B_min40)/190*(AO89-150)+Rds_ON_V5B_150","v":0.6761350958740141},0.67679362734274728,0.67746708933379041,0.67815537605434606,0.67885838874540327,0.67957603510348918,0.680308228758844,0.6810548888036686,0.68181593936489804,0.68259130921665412,0.68338093142811984,0.68418474304310106,0.6850026847879831,0.68583470080517484,0.68668073840947497,0.68754074786508046,0.68841468218122048,0.68930249692461609,0.69020415004716629,0.72279036737913116]
[null,null,null,null,null,null,null,"Dropout",{"$f":"I99-I140","v":0.34999999999999964},0.34999999999999964,0.34999999999999964,0.34999999999999964,0.34999999999999964,0.34999999999999964,0.34999999999999964,0.34999999999999964,0.34999999999999964,0.34999999999999964,0.34999999999999964,0.34999999999999964,0.34999999999999964,0.35000000000000053,0.34999999999999964,0.34999999999999964,0.34999999999999964,0.35000000000000053,0.34999999999999964,0.35000000000000142,0.34999999999999964,0.34999999999999964,0.35000000000000053,0.34999999999999964,0.34999999999999964,0.34999999999999964,0.34999999999999876,0.34999999999999964,0.34999999999999964,0.34999999999999964,0.34999999999999964,0.34999999999999964,{"$f":"AO99-AO140","v":0.35000000000000053},0.34999999999999964,0.35000000000000053,0.34999999999999964,0.34999999999999964,0.34999999999999964,0.34999999999999876,0.34999999999999964,0.34999999999999876,0.34999999999999964,0.34999999999999964,0.34999999999999964,0.34999999999999964,0.34999999999999964,0.34999999999999964,0.34999999999999964,0.34999999999999964,0.34999999999999964,0.34999999999999964,0.35000000000000053]
[null,null,null,null,null,null,null,"Power dissipated",{"$f":"(I99-I140)*Iout_V5B","v":1.7499999999999984E-2},1.7499999999999984E-2,1.7499999999999984E-2,1.7499999999999984E-2,1.7499999999999984E-2,1.7499999999999984E-2,1.7499999999999984E-2,1.7499999999999984E-2,1.7499999999999984E-2,1.7499999999999984E-2,1.7499999999999984E-2,1.7499999999999984E-2,1.7499999999999984E-2,1.7500000000000026E-2,1.7499999999999984E-2,1.7499999999999984E-2,1.7499999999999984E-2,1.7500000000000026E-2,1.7499999999999984E-2,1.7500000000000071E-2,1.7499999999999984E-2,1.7499999999999984E-2,1.7500000000000026E-2,1.7499999999999984E-2,1.7499999999999984E-2,1.7499999999999984E-2,1.7499999999999939E-2,1.7499999999999984E-2,1.7499999999999984E-2,1.7499999999999984E-2,1.7499999999999984E-2,1.7499999999999984E-2,{"$f":"(AO99-AO140)*Iout_V5B","v":1.7500000000000026E-2},1.7499999999999984E-2,1.7500000000000026E-2,1.7499999999999984E-2,1.7499999999999984E-2,1.7499999999999984E-2,1.7499999999999939E-2,1.7499999999999984E-2,1.7499999999999939E-2,1.7499999999999984E-2,1.7499999999999984E-2,1.7499999999999984E-2,1.7499999999999984E-2,1.7499999999999984E-2,1.7499999999999984E-2,1.7499999999999984E-2,1.7499999999999984E-2,1.7499999999999984E-2,1.7499999999999984E-2,1.7500000000000026E-2]
[null,null,null,null,null,null,"V5CAN LDO","Output voltage",{"$f":"IF(I99-5<I145*Iout_V5CAN,I99-I145*Iout_sync_buck,5)","v":5},5,5,5,5,5,5,5,5,5,5,5,5,5,5,5,5,5,5,5,5,5,5,5,5,5,5,5,5,5,5,5,{"$f":"IF(AO99-5<AO145*Iout_V5CAN,AO99-AO145*Iout_sync_buck,5)","v":5},5,5,5,5,5,5,5,5,5,5,5,5,5,5,5,5,5,5,5]
[null,null,null,null,null,null,null,"Series pass resistance",{"$f":"(Rds_ON_V5CAN_150-Rds_ON_V5CAN_min40)/190*(I89-150)+Rds_ON_V5CAN_150","v":0.48766462266510568},0.48359018250150049,0.48358882800762143,0.4836088454903269,0.48364867097529451,0.48370696897831172,0.48348906059561347,0.48359049714438634,0.4837067981031139,0.48383726673072286,0.48398129116875321,0.48413833173497983,0.48430791045517374,0.48448960238296446,0.48468302835878507,0.48488784893501646,0.48510375925233268,0.48533048469663043,0.48556777720021876,0.48581541207764695,0.48607318530747962,0.48634091118785033,0.48661842030674868,0.48690555777848049,0.48720218170616969,0.48750816183697787,0.48782337838224887,0.48814772097930048,0.48848108777528459,0.48882338461659081,0.48917452432978625,0.48953442608218445,{"$f":"(Rds_ON_V5CAN_150-Rds_ON_V5CAN_min40)/190*(AO89-150)+Rds_ON_V5CAN_150","v":0.48990301481188087},0.49028022071855709,0.49066597880758528,0.49106022848099856,0.49146291316977331,0.49187398000260896,0.49229337950702751,0.49272106533915455,0.49315699403900443,0.49360112480849327,0.49405341930974256,0.49451384148153221,0.49498235737201823,0.49545893498605048,0.49594354414561909,0.49643615636212546,0.49693674471932164,0.49744528376588731,0.4979617494167291,0.51662708924855205]
[null,null,null,null,null,null,null,"Dropout",{"$f":"I99-I144","v":0.34999999999999964},0.34999999999999964,0.34999999999999964,0.34999999999999964,0.34999999999999964,0.34999999999999964,0.34999999999999964,0.34999999999999964,0.34999999999999964,0.34999999999999964,0.34999999999999964,0.34999999999999964,0.34999999999999964,0.35000000000000053,0.34999999999999964,0.34999999999999964,0.34999999999999964,0.35000000000000053,0.34999999999999964,0.35000000000000142,0.34999999999999964,0.34999999999999964,0.35000000000000053,0.34999999999999964,0.34999999999999964,0.34999999999999964,0.34999999999999876,0.34999999999999964,0.34999999999999964,0.34999999999999964,0.34999999999999964,0.34999999999999964,{"$f":"AO99-AO144","v":0.35000000000000053},0.34999999999999964,0.35000000000000053,0.34999999999999964,0.34999999999999964,0.34999999999999964,0.34999999999999876,0.34999999999999964,0.34999999999999876,0.34999999999999964,0.34999999999999964,0.34999999999999964,0.34999999999999964,0.34999999999999964,0.34999999999999964,0.34999999999999964,0.34999999999999964,0.34999999999999964,0.34999999999999964,0.35000000000000053]
[null,null,null,null,null,null,null,"Power dissipated",{"$f":"(I99-I144)*Iout_V5CAN","v":6.9999999999999937E-2},6.9999999999999937E-2,6.9999999999999937E-2,6.9999999999999937E-2,6.9999999999999937E-2,6.9999999999999937E-2,6.9999999999999937E-2,6.9999999999999937E-2,6.9999999999999937E-2,6.9999999999999937E-2,6.9999999999999937E-2,6.9999999999999937E-2,6.9999999999999937E-2,7.0000000000000104E-2,6.9999999999999937E-2,6.9999999999999937E-2,6.9999999999999937E-2,7.0000000000000104E-2,6.9999999999999937E-2,7.0000000000000284E-2,6.9999999999999937E-2,6.9999999999999937E-2,7.0000000000000104E-2,6.9999999999999937E-2,6.9999999999999937E-2,6.9999999999999937E-2,6.9999999999999757E-2,6.9999999999999937E-2,6.9999999999999937E-2,6.9999999999999937E-2,6.9999999999999937E-2,6.9999999999999937E-2,{"$f":"(AO99-AO144)*Iout_V5CAN","v":7.0000000000000104E-2},6.9999999999999937E-2,7.0000000000000104E-2,6.9999999999999937E-2,6.9999999999999937E-2,6.9999999999999937E-2,6.9999999999999757E-2,6.9999999999999937E-2,6.9999999999999757E-2,6.9999999999999937E-2,6.9999999999999937E-2,6.9999999999999937E-2,6.9999999999999937E-2,6.9999999999999937E-2,6.9999999999999937E-2,6.9999999999999937E-2,6.9999999999999937E-2,6.9999999999999937E-2,6.9999999999999937E-2,7.0000000000000104E-2]
[null,null,null,null,null,null,"V5P LDO","Output voltage",{"$f":"IF(I99-5<I149*Iout_V5P,I99-I149*Iout_V5P,5)","v":5},5,5,5,5,5,5,5,5,5,5,5,5,5,5,5,5,5,5,5,5,5,5,5,5,5,5,5,5,5,5,5,{"$f":"IF(AO99-5<AO149*Iout_V5P,AO99-AO149*Iout_V5P,5)","v":5},5,5,5,5,5,5,5,5,5,5,5,5,5,5,5,5,5,5,5,"Output voltage"]
[null,null,null,null,null,null,null,"Series pass resistance",{"$f":"(Rds_ON_V5P_150-Rds_ON_V5P_min40)/190*(I89-150)+Rds_ON_V5P_150","v":0.67222727883847211},0.66511406290596808,0.66511169821117466,0.6651466450188811,0.66521617292033908,0.66531795040810271,0.66493752283587315,0.66511461221401991,0.66531765209173765,0.66554542608849176,0.66579686601302879,0.66607102968039855,0.66636708263635347,0.66668428300344018,0.66702196883946185,0.66737954753190842,0.66775648685300693,0.66815230737752673,0.66856657602534375,0.66899890053738353,0.66944892473010509,0.66991632440253324,0.67040080379275602,0.67090209249911281,0.67141994279600703,0.67195412728616988,0.67250443684085148,0.67307067878730231,0.6736526753093629,0.67425026203231297,0.67486328676752638,0.67549160839614242,{"$f":"(Rds_ON_V5P_150-Rds_ON_V5P_min40)/190*(AO89-150)+Rds_ON_V5P_150","v":0.6761350958740141},0.67679362734274728,0.67746708933379041,0.67815537605434606,0.67885838874540327,0.67957603510348918,0.680308228758844,0.6810548888036686,0.68181593936489804,0.68259130921665412,0.68338093142811984,0.68418474304310106,0.6850026847879831,0.68583470080517484,0.68668073840947497,0.68754074786508046,0.68841468218122048,0.68930249692461609,0.69020415004716629,0.72279036737913116,"Series pass resistance"]
[null,null,null,null,null,null,null,"Dropout",{"$f":"I99-I148","v":0.34999999999999964},0.34999999999999964,0.34999999999999964,0.34999999999999964,0.34999999999999964,0.34999999999999964,0.34999999999999964,0.34999999999999964,0.34999999999999964,0.34999999999999964,0.34999999999999964,0.34999999999999964,0.34999999999999964,0.35000000000000053,0.34999999999999964,0.34999999999999964,0.34999999999999964,0.35000000000000053,0.34999999999999964,0.35000000000000142,0.34999999999999964,0.34999999999999964,0.35000000000000053,0.34999999999999964,0.34999999999999964,0.34999999999999964,0.34999999999999876,0.34999999999999964,0.34999999999999964,0.34999999999999964,0.34999999999999964,0.34999999999999964,{"$f":"AO99-AO148","v":0.35000000000000053},0.34999999999999964,0.35000000000000053,0.34999999999999964,0.34999999999999964,0.34999999999999964,0.34999999999999876,0.34999999999999964,0.34999999999999876,0.34999999999999964,0.34999999999999964,0.34999999999999964,0.34999999999999964,0.34999999999999964,0.34999999999999964,0.34999999999999964,0.34999999999999964,0.34999999999999964,0.34999999999999964,0.35000000000000053,"Dropout"]
[null,null,null,null,null,null,null,"Power dissipated",{"$f":"(I99-I148)*Iout_V5P","v":2.6249999999999971E-2},2.6249999999999971E-2,2.6249999999999971E-2,2.6249999999999971E-2,2.6249999999999971E-2,2.6249999999999971E-2,2.6249999999999971E-2,2.6249999999999971E-2,2.6249999999999971E-2,2.6249999999999971E-2,2.6249999999999971E-2,2.6249999999999971E-2,2.6249999999999971E-2,2.6250000000000041E-2,2.6249999999999971E-2,2.6249999999999971E-2,2.6249999999999971E-2,2.6250000000000041E-2,2.6249999999999971E-2,2.6250000000000107E-2,2.6249999999999971E-2,2.6249999999999971E-2,2.6250000000000041E-2,2.6249999999999971E-2,2.6249999999999971E-2,2.6249999999999971E-2,2.6249999999999905E-2,2.6249999999999971E-2,2.6249999999999971E-2,2.6249999999999971E-2,2.6249999999999971E-2,2.6249999999999971E-2,{"$f":"(AO99-AO148)*Iout_V5P","v":2.6250000000000041E-2},2.6249999999999971E-2,2.6250000000000041E-2,2.6249999999999971E-2,2.6249999999999971E-2,2.6249999999999971E-2,2.6249999999999905E-2,2.6249999999999971E-2,2.6249999999999905E-2,2.6249999999999971E-2,2.6249999999999971E-2,2.6249999999999971E-2,2.6249999999999971E-2,2.6249999999999971E-2,2.6249999999999971E-2,2.6249999999999971E-2,2.6249999999999971E-2,2.6249999999999971E-2,2.6249999999999971E-2,2.6250000000000041E-2,"Power dissipated"]
[null,null,null,null,null,null,"Buck Diode","Tj Diode",{"$f":"I155*RTHavg_Vd+Ta","v":143.38448652702658},{"$f":"J155*RTHavg_Vd+Ta","v":127.73499179817318},129.0006879479962,130.16495358669917,131.23946047686874,132.23416280490252,133.1967791972088,134.05364808464384,134.85327296571305,135.6011878003805,136.30223750316233,136.96068166293509,137.58028012283339,138.16436400768549,138.71589499978938,139.23751506562382,139.73158837757572,140.2002368206895,140.64537019908303,141.06871204108495,141.4718217322816,141.85611357101024,142.22287323347936,142.57327204963801,142.90837942156384,143.22917365997401,143.53655146875883,143.83133627007587,144.11428553186826,144.38609723437909,144.64741559129934,144.8988361237902,145.14091017111051,{"$f":"AP155*RTHavg_Vd+Ta","v":145.37414890943589},145.59902694025502,145.81598550113438,146.02543534437589,146.22775932293177,146.4233147177018,146.61243533586952,146.79543340611315,146.97260129325062,147.14421305206116,147.31052583759907,147.47178118721777,147.62820618770692,147.78001453937006,147.9274075274987,148.0705749105054,148.2096957329349,148.34493907065863,153.18805097524651,"Tj Diode"]
[null,null,null,null,null,null,null,"I Buck Diode ON",{"$f":"I102-I103/2","v":0.83065420560747671},0.83065420560747671,0.83065420560747671,0.83065420560747671,0.83065420560747683,0.83065420560747671,0.83065420560747671,0.83065420560747671,0.83065420560747671,0.83065420560747671,0.83065420560747671,0.83065420560747671,0.83065420560747671,0.83065420560747671,0.83065420560747671,0.83065420560747671,0.83065420560747671,0.83065420560747671,0.83065420560747683,0.8306542056074766,0.83065420560747671,0.83065420560747671,0.8306542056074766,0.83065420560747671,0.83065420560747671,0.83065420560747671,0.8306542056074766,0.83065420560747671,0.8306542056074766,0.8306542056074766,0.83065420560747671,0.8306542056074766,{"$f":"AO102-AO103/2","v":0.8306542056074766},0.83065420560747671,0.83065420560747671,0.83065420560747671,0.83065420560747683,0.83065420560747683,0.8306542056074766,0.8306542056074766,0.83065420560747683,0.83065420560747671,0.83065420560747683,0.83065420560747683,0.83065420560747671,0.83065420560747671,0.83065420560747671,0.83065420560747683,0.8306542056074766,0.83065420560747671,0.83065420560747671,0.83065420560747683,"I Buck Diode ON"]
[null,null,null,null,null,null,null,"Vf buck diode",{"$f":"IF(I153<I_Vd1,Vd_1+(I152-25)*vd_temp_coeff/1000,IF(I153=0,0,IF(Reset=1,0.45,FORECAST(I153, OFFSET(Vd_1:Vd_3,MATCH(I153,I_Vd1:I_Vd3,1)-1,0,2), OFFSET(I_Vd1:I_Vd3,MATCH(I153,I_Vd1:I_Vd3,1)-1,0,2))+(I152-25)*vd_temp_coeff/1000)))","v":0.34761712084046531},{"$f":"IF(J153<I_Vd1,Vd_1+(J152-25)*vd_temp_coeff/1000,IF(J153=0,0,IF(Reset=1,0.45,FORECAST(J153, OFFSET(Vd_1:Vd_3,MATCH(J153,I_Vd1:I_Vd3,1)-1,0,2), OFFSET(I_Vd1:I_Vd3,MATCH(J153,I_Vd1:I_Vd3,1)-1,0,2))+(J152-25)*vd_temp_coeff/1000)))","v":0.36639651451508937},{"$f":"IF(K153<I_Vd1,Vd_1+(K152-25)*vd_temp_coeff/1000,IF(K153=0,0,IF(Reset=1,0.45,FORECAST(K153, OFFSET(Vd_1:Vd_3,MATCH(K153,I_Vd1:I_Vd3,1)-1,0,2), OFFSET(I_Vd1:I_Vd3,MATCH(K153,I_Vd1:I_Vd3,1)-1,0,2))+(K152-25)*vd_temp_coeff/1000)))","v":0.36487767913530178},{"$f":"IF(L153<I_Vd1,Vd_1+(L152-25)*vd_temp_coeff/1000,IF(L153=0,0,IF(Reset=1,0.45,FORECAST(L153, OFFSET(Vd_1:Vd_3,MATCH(L153,I_Vd1:I_Vd3,1)-1,0,2), OFFSET(I_Vd1:I_Vd3,MATCH(L153,I_Vd1:I_Vd3,1)-1,0,2))+(L152-25)*vd_temp_coeff/1000)))","v":0.36348056036885823},{"$f":"IF(M153<I_Vd1,Vd_1+(M152-25)*vd_temp_coeff/1000,IF(M153=0,0,IF(Reset=1,0.45,FORECAST(M153, OFFSET(Vd_1:Vd_3,MATCH(M153,I_Vd1:I_Vd3,1)-1,0,2), OFFSET(I_Vd1:I_Vd3,MATCH(M153,I_Vd1:I_Vd3,1)-1,0,2))+(M152-25)*vd_temp_coeff/1000)))","v":0.36219115210065472},{"$f":"IF(N153<I_Vd1,Vd_1+(N152-25)*vd_temp_coeff/1000,IF(N153=0,0,IF(Reset=1,0.45,FORECAST(N153, OFFSET(Vd_1:Vd_3,MATCH(N153,I_Vd1:I_Vd3,1)-1,0,2), OFFSET(I_Vd1:I_Vd3,MATCH(N153,I_Vd1:I_Vd3,1)-1,0,2))+(N152-25)*vd_temp_coeff/1000)))","v":0.36099750930701413},{"$f":"IF(O153<I_Vd1,Vd_1+(O152-25)*vd_temp_coeff/1000,IF(O153=0,0,IF(Reset=1,0.45,FORECAST(O153, OFFSET(Vd_1:Vd_3,MATCH(O153,I_Vd1:I_Vd3,1)-1,0,2), OFFSET(I_Vd1:I_Vd3,MATCH(O153,I_Vd1:I_Vd3,1)-1,0,2))+(O152-25)*vd_temp_coeff/1000)))","v":0.35984236963624666},{"$f":"IF(P153<I_Vd1,Vd_1+(P152-25)*vd_temp_coeff/1000,IF(P153=0,0,IF(Reset=1,0.45,FORECAST(P153, OFFSET(Vd_1:Vd_3,MATCH(P153,I_Vd1:I_Vd3,1)-1,0,2), OFFSET(I_Vd1:I_Vd3,MATCH(P153,I_Vd1:I_Vd3,1)-1,0,2))+(P152-25)*vd_temp_coeff/1000)))","v":0.35881412697132459},{"$f":"IF(Q153<I_Vd1,Vd_1+(Q152-25)*vd_temp_coeff/1000,IF(Q153=0,0,IF(Reset=1,0.45,FORECAST(Q153, OFFSET(Vd_1:Vd_3,MATCH(Q153,I_Vd1:I_Vd3,1)-1,0,2), OFFSET(I_Vd1:I_Vd3,MATCH(Q153,I_Vd1:I_Vd3,1)-1,0,2))+(Q152-25)*vd_temp_coeff/1000)))","v":0.35785457711404156},{"$f":"IF(R153<I_Vd1,Vd_1+(R152-25)*vd_temp_coeff/1000,IF(R153=0,0,IF(Reset=1,0.45,FORECAST(R153, OFFSET(Vd_1:Vd_3,MATCH(R153,I_Vd1:I_Vd3,1)-1,0,2), OFFSET(I_Vd1:I_Vd3,MATCH(R153,I_Vd1:I_Vd3,1)-1,0,2))+(R152-25)*vd_temp_coeff/1000)))","v":0.35695707931244058},{"$f":"IF(S153<I_Vd1,Vd_1+(S152-25)*vd_temp_coeff/1000,IF(S153=0,0,IF(Reset=1,0.45,FORECAST(S153, OFFSET(Vd_1:Vd_3,MATCH(S153,I_Vd1:I_Vd3,1)-1,0,2), OFFSET(I_Vd1:I_Vd3,MATCH(S153,I_Vd1:I_Vd3,1)-1,0,2))+(S152-25)*vd_temp_coeff/1000)))","v":0.35611581966910244},{"$f":"IF(T153<I_Vd1,Vd_1+(T152-25)*vd_temp_coeff/1000,IF(T153=0,0,IF(Reset=1,0.45,FORECAST(T153, OFFSET(Vd_1:Vd_3,MATCH(T153,I_Vd1:I_Vd3,1)-1,0,2), OFFSET(I_Vd1:I_Vd3,MATCH(T153,I_Vd1:I_Vd3,1)-1,0,2))+(T152-25)*vd_temp_coeff/1000)))","v":0.35532568667737507},{"$f":"IF(U153<I_Vd1,Vd_1+(U152-25)*vd_temp_coeff/1000,IF(U153=0,0,IF(Reset=1,0.45,FORECAST(U153, OFFSET(Vd_1:Vd_3,MATCH(U153,I_Vd1:I_Vd3,1)-1,0,2), OFFSET(I_Vd1:I_Vd3,MATCH(U153,I_Vd1:I_Vd3,1)-1,0,2))+(U152-25)*vd_temp_coeff/1000)))","v":0.35458216852549718},{"$f":"IF(V153<I_Vd1,Vd_1+(V152-25)*vd_temp_coeff/1000,IF(V153=0,0,IF(Reset=1,0.45,FORECAST(V153, OFFSET(Vd_1:Vd_3,MATCH(V153,I_Vd1:I_Vd3,1)-1,0,2), OFFSET(I_Vd1:I_Vd3,MATCH(V153,I_Vd1:I_Vd3,1)-1,0,2))+(V152-25)*vd_temp_coeff/1000)))","v":0.35388126786367458},{"$f":"IF(W153<I_Vd1,Vd_1+(W152-25)*vd_temp_coeff/1000,IF(W153=0,0,IF(Reset=1,0.45,FORECAST(W153, OFFSET(Vd_1:Vd_3,MATCH(W153,I_Vd1:I_Vd3,1)-1,0,2), OFFSET(I_Vd1:I_Vd3,MATCH(W153,I_Vd1:I_Vd3,1)-1,0,2))+(W152-25)*vd_temp_coeff/1000)))","v":0.35321943067314993},{"$f":"IF(X153<I_Vd1,Vd_1+(X152-25)*vd_temp_coeff/1000,IF(X153=0,0,IF(Reset=1,0.45,FORECAST(X153, OFFSET(Vd_1:Vd_3,MATCH(X153,I_Vd1:I_Vd3,1)-1,0,2), OFFSET(I_Vd1:I_Vd3,MATCH(X153,I_Vd1:I_Vd3,1)-1,0,2))+(X152-25)*vd_temp_coeff/1000)))","v":0.35259348659414858},{"$f":"IF(Y153<I_Vd1,Vd_1+(Y152-25)*vd_temp_coeff/1000,IF(Y153=0,0,IF(Reset=1,0.45,FORECAST(Y153, OFFSET(Vd_1:Vd_3,MATCH(Y153,I_Vd1:I_Vd3,1)-1,0,2), OFFSET(I_Vd1:I_Vd3,MATCH(Y153,I_Vd1:I_Vd3,1)-1,0,2))+(Y152-25)*vd_temp_coeff/1000)))","v":0.35200059861980637},{"$f":"IF(Z153<I_Vd1,Vd_1+(Z152-25)*vd_temp_coeff/1000,IF(Z153=0,0,IF(Reset=1,0.45,FORECAST(Z153, OFFSET(Vd_1:Vd_3,MATCH(Z153,I_Vd1:I_Vd3,1)-1,0,2), OFFSET(I_Vd1:I_Vd3,MATCH(Z153,I_Vd1:I_Vd3,1)-1,0,2))+(Z152-25)*vd_temp_coeff/1000)))","v":0.35143822048806983},{"$f":"IF(AA153<I_Vd1,Vd_1+(AA152-25)*vd_temp_coeff/1000,IF(AA153=0,0,IF(Reset=1,0.45,FORECAST(AA153, OFFSET(Vd_1:Vd_3,MATCH(AA153,I_Vd1:I_Vd3,1)-1,0,2), OFFSET(I_Vd1:I_Vd3,MATCH(AA153,I_Vd1:I_Vd3,1)-1,0,2))+(AA152-25)*vd_temp_coeff/1000)))","v":0.35090406043399758},{"$f":"IF(AB153<I_Vd1,Vd_1+(AB152-25)*vd_temp_coeff/1000,IF(AB153=0,0,IF(Reset=1,0.45,FORECAST(AB153, OFFSET(Vd_1:Vd_3,MATCH(AB153,I_Vd1:I_Vd3,1)-1,0,2), OFFSET(I_Vd1:I_Vd3,MATCH(AB153,I_Vd1:I_Vd3,1)-1,0,2))+(AB152-25)*vd_temp_coeff/1000)))","v":0.35039605022359527},{"$f":"IF(AC153<I_Vd1,Vd_1+(AC152-25)*vd_temp_coeff/1000,IF(AC153=0,0,IF(Reset=1,0.45,FORECAST(AC153, OFFSET(Vd_1:Vd_3,MATCH(AC153,I_Vd1:I_Vd3,1)-1,0,2), OFFSET(I_Vd1:I_Vd3,MATCH(AC153,I_Vd1:I_Vd3,1)-1,0,2))+(AC152-25)*vd_temp_coeff/1000)))","v":0.34991231859415928},{"$f":"IF(AD153<I_Vd1,Vd_1+(AD152-25)*vd_temp_coeff/1000,IF(AD153=0,0,IF(Reset=1,0.45,FORECAST(AD153, OFFSET(Vd_1:Vd_3,MATCH(AD153,I_Vd1:I_Vd3,1)-1,0,2), OFFSET(I_Vd1:I_Vd3,MATCH(AD153,I_Vd1:I_Vd3,1)-1,0,2))+(AD152-25)*vd_temp_coeff/1000)))","v":0.34945116838768492},{"$f":"IF(AE153<I_Vd1,Vd_1+(AE152-25)*vd_temp_coeff/1000,IF(AE153=0,0,IF(Reset=1,0.45,FORECAST(AE153, OFFSET(Vd_1:Vd_3,MATCH(AE153,I_Vd1:I_Vd3,1)-1,0,2), OFFSET(I_Vd1:I_Vd3,MATCH(AE153,I_Vd1:I_Vd3,1)-1,0,2))+(AE152-25)*vd_temp_coeff/1000)))","v":0.34901105679272199},{"$f":"IF(AF153<I_Vd1,Vd_1+(AF152-25)*vd_temp_coeff/1000,IF(AF153=0,0,IF(Reset=1,0.45,FORECAST(AF153, OFFSET(Vd_1:Vd_3,MATCH(AF153,I_Vd1:I_Vd3,1)-1,0,2), OFFSET(I_Vd1:I_Vd3,MATCH(AF153,I_Vd1:I_Vd3,1)-1,0,2))+(AF152-25)*vd_temp_coeff/1000)))","v":0.34859057821333161},{"$f":"IF(AG153<I_Vd1,Vd_1+(AG152-25)*vd_temp_coeff/1000,IF(AG153=0,0,IF(Reset=1,0.45,FORECAST(AG153, OFFSET(Vd_1:Vd_3,MATCH(AG153,I_Vd1:I_Vd3,1)-1,0,2), OFFSET(I_Vd1:I_Vd3,MATCH(AG153,I_Vd1:I_Vd3,1)-1,0,2))+(AG152-25)*vd_temp_coeff/1000)))","v":0.34818844936702059},{"$f":"IF(AH153<I_Vd1,Vd_1+(AH152-25)*vd_temp_coeff/1000,IF(AH153=0,0,IF(Reset=1,0.45,FORECAST(AH153, OFFSET(Vd_1:Vd_3,MATCH(AH153,I_Vd1:I_Vd3,1)-1,0,2), OFFSET(I_Vd1:I_Vd3,MATCH(AH153,I_Vd1:I_Vd3,1)-1,0,2))+(AH152-25)*vd_temp_coeff/1000)))","v":0.34780349628092838},{"$f":"IF(AI153<I_Vd1,Vd_1+(AI152-25)*vd_temp_coeff/1000,IF(AI153=0,0,IF(Reset=1,0.45,FORECAST(AI153, OFFSET(Vd_1:Vd_3,MATCH(AI153,I_Vd1:I_Vd3,1)-1,0,2), OFFSET(I_Vd1:I_Vd3,MATCH(AI153,I_Vd1:I_Vd3,1)-1,0,2))+(AI152-25)*vd_temp_coeff/1000)))","v":0.34743464291038662},{"$f":"IF(AJ153<I_Vd1,Vd_1+(AJ152-25)*vd_temp_coeff/1000,IF(AJ153=0,0,IF(Reset=1,0.45,FORECAST(AJ153, OFFSET(Vd_1:Vd_3,MATCH(AJ153,I_Vd1:I_Vd3,1)-1,0,2), OFFSET(I_Vd1:I_Vd3,MATCH(AJ153,I_Vd1:I_Vd3,1)-1,0,2))+(AJ152-25)*vd_temp_coeff/1000)))","v":0.34708090114880619},{"$f":"IF(AK153<I_Vd1,Vd_1+(AK152-25)*vd_temp_coeff/1000,IF(AK153=0,0,IF(Reset=1,0.45,FORECAST(AK153, OFFSET(Vd_1:Vd_3,MATCH(AK153,I_Vd1:I_Vd3,1)-1,0,2), OFFSET(I_Vd1:I_Vd3,MATCH(AK153,I_Vd1:I_Vd3,1)-1,0,2))+(AK152-25)*vd_temp_coeff/1000)))","v":0.34674136203465528},{"$f":"IF(AL153<I_Vd1,Vd_1+(AL152-25)*vd_temp_coeff/1000,IF(AL153=0,0,IF(Reset=1,0.45,FORECAST(AL153, OFFSET(Vd_1:Vd_3,MATCH(AL153,I_Vd1:I_Vd3,1)-1,0,2), OFFSET(I_Vd1:I_Vd3,MATCH(AL153,I_Vd1:I_Vd3,1)-1,0,2))+(AL152-25)*vd_temp_coeff/1000)))","v":0.34641518799164228},{"$f":"IF(AM153<I_Vd1,Vd_1+(AM152-25)*vd_temp_coeff/1000,IF(AM153=0,0,IF(Reset=1,0.45,FORECAST(AM153, OFFSET(Vd_1:Vd_3,MATCH(AM153,I_Vd1:I_Vd3,1)-1,0,2), OFFSET(I_Vd1:I_Vd3,MATCH(AM153,I_Vd1:I_Vd3,1)-1,0,2))+(AM152-25)*vd_temp_coeff/1000)))","v":0.346101605963338},{"$f":"IF(AN153<I_Vd1,Vd_1+(AN152-25)*vd_temp_coeff/1000,IF(AN153=0,0,IF(Reset=1,0.45,FORECAST(AN153, OFFSET(Vd_1:Vd_3,MATCH(AN153,I_Vd1:I_Vd3,1)-1,0,2), OFFSET(I_Vd1:I_Vd3,MATCH(AN153,I_Vd1:I_Vd3,1)-1,0,2))+(AN152-25)*vd_temp_coeff/1000)))","v":0.34579990132434896},{"$f":"IF(AO153<I_Vd1,Vd_1+(AO152-25)*vd_temp_coeff/1000,IF(AO153=0,0,IF(Reset=1,0.45,FORECAST(AO153, OFFSET(Vd_1:Vd_3,MATCH(AO153,I_Vd1:I_Vd3,1)-1,0,2), OFFSET(I_Vd1:I_Vd3,MATCH(AO153,I_Vd1:I_Vd3,1)-1,0,2))+(AO152-25)*vd_temp_coeff/1000)))","v":0.34550941246756461},{"$f":"IF(AP153<I_Vd1,Vd_1+(AP152-25)*vd_temp_coeff/1000,IF(AP153=0,0,IF(Reset=1,0.45,FORECAST(AP153, OFFSET(Vd_1:Vd_3,MATCH(AP153,I_Vd1:I_Vd3,1)-1,0,2), OFFSET(I_Vd1:I_Vd3,MATCH(AP153,I_Vd1:I_Vd3,1)-1,0,2))+(AP152-25)*vd_temp_coeff/1000)))","v":0.34522952598157414},{"$f":"IF(AQ153<I_Vd1,Vd_1+(AQ152-25)*vd_temp_coeff/1000,IF(AQ153=0,0,IF(Reset=1,0.45,FORECAST(AQ153, OFFSET(Vd_1:Vd_3,MATCH(AQ153,I_Vd1:I_Vd3,1)-1,0,2), OFFSET(I_Vd1:I_Vd3,MATCH(AQ153,I_Vd1:I_Vd3,1)-1,0,2))+(AQ152-25)*vd_temp_coeff/1000)))","v":0.34495967234459118},{"$f":"IF(AR153<I_Vd1,Vd_1+(AR152-25)*vd_temp_coeff/1000,IF(AR153=0,0,IF(Reset=1,0.45,FORECAST(AR153, OFFSET(Vd_1:Vd_3,MATCH(AR153,I_Vd1:I_Vd3,1)-1,0,2), OFFSET(I_Vd1:I_Vd3,MATCH(AR153,I_Vd1:I_Vd3,1)-1,0,2))+(AR152-25)*vd_temp_coeff/1000)))","v":0.34469932207153597},{"$f":"IF(AS153<I_Vd1,Vd_1+(AS152-25)*vd_temp_coeff/1000,IF(AS153=0,0,IF(Reset=1,0.45,FORECAST(AS153, OFFSET(Vd_1:Vd_3,MATCH(AS153,I_Vd1:I_Vd3,1)-1,0,2), OFFSET(I_Vd1:I_Vd3,MATCH(AS153,I_Vd1:I_Vd3,1)-1,0,2))+(AS152-25)*vd_temp_coeff/1000)))","v":0.34444798225964612},{"$f":"IF(AT153<I_Vd1,Vd_1+(AT152-25)*vd_temp_coeff/1000,IF(AT153=0,0,IF(Reset=1,0.45,FORECAST(AT153, OFFSET(Vd_1:Vd_3,MATCH(AT153,I_Vd1:I_Vd3,1)-1,0,2), OFFSET(I_Vd1:I_Vd3,MATCH(AT153,I_Vd1:I_Vd3,1)-1,0,2))+(AT152-25)*vd_temp_coeff/1000)))","v":0.34420519348537904},{"$f":"IF(AU153<I_Vd1,Vd_1+(AU152-25)*vd_temp_coeff/1000,IF(AU153=0,0,IF(Reset=1,0.45,FORECAST(AU153, OFFSET(Vd_1:Vd_3,MATCH(AU153,I_Vd1:I_Vd3,1)-1,0,2), OFFSET(I_Vd1:I_Vd3,MATCH(AU153,I_Vd1:I_Vd3,1)-1,0,2))+(AU152-25)*vd_temp_coeff/1000)))","v":0.34397052701165504},{"$f":"IF(AV153<I_Vd1,Vd_1+(AV152-25)*vd_temp_coeff/1000,IF(AV153=0,0,IF(Reset=1,0.45,FORECAST(AV153, OFFSET(Vd_1:Vd_3,MATCH(AV153,I_Vd1:I_Vd3,1)-1,0,2), OFFSET(I_Vd1:I_Vd3,MATCH(AV153,I_Vd1:I_Vd3,1)-1,0,2))+(AV152-25)*vd_temp_coeff/1000)))","v":0.3437435822698538},{"$f":"IF(AW153<I_Vd1,Vd_1+(AW152-25)*vd_temp_coeff/1000,IF(AW153=0,0,IF(Reset=1,0.45,FORECAST(AW153, OFFSET(Vd_1:Vd_3,MATCH(AW153,I_Vd1:I_Vd3,1)-1,0,2), OFFSET(I_Vd1:I_Vd3,MATCH(AW153,I_Vd1:I_Vd3,1)-1,0,2))+(AW152-25)*vd_temp_coeff/1000)))","v":0.34352398458556144},{"$f":"IF(AX153<I_Vd1,Vd_1+(AX152-25)*vd_temp_coeff/1000,IF(AX153=0,0,IF(Reset=1,0.45,FORECAST(AX153, OFFSET(Vd_1:Vd_3,MATCH(AX153,I_Vd1:I_Vd3,1)-1,0,2), OFFSET(I_Vd1:I_Vd3,MATCH(AX153,I_Vd1:I_Vd3,1)-1,0,2))+(AX152-25)*vd_temp_coeff/1000)))","v":0.34331138312099646},{"$f":"IF(AY153<I_Vd1,Vd_1+(AY152-25)*vd_temp_coeff/1000,IF(AY153=0,0,IF(Reset=1,0.45,FORECAST(AY153, OFFSET(Vd_1:Vd_3,MATCH(AY153,I_Vd1:I_Vd3,1)-1,0,2), OFFSET(I_Vd1:I_Vd3,MATCH(AY153,I_Vd1:I_Vd3,1)-1,0,2))+(AY152-25)*vd_temp_coeff/1000)))","v":0.34310544901042384},{"$f":"IF(AZ153<I_Vd1,Vd_1+(AZ152-25)*vd_temp_coeff/1000,IF(AZ153=0,0,IF(Reset=1,0.45,FORECAST(AZ153, OFFSET(Vd_1:Vd_3,MATCH(AZ153,I_Vd1:I_Vd3,1)-1,0,2), OFFSET(I_Vd1:I_Vd3,MATCH(AZ153,I_Vd1:I_Vd3,1)-1,0,2))+(AZ152-25)*vd_temp_coeff/1000)))","v":0.3429058736677783},{"$f":"IF(BA153<I_Vd1,Vd_1+(BA152-25)*vd_temp_coeff/1000,IF(BA153=0,0,IF(Reset=1,0.45,FORECAST(BA153, OFFSET(Vd_1:Vd_3,MATCH(BA153,I_Vd1:I_Vd3,1)-1,0,2), OFFSET(I_Vd1:I_Vd3,MATCH(BA153,I_Vd1:I_Vd3,1)-1,0,2))+(BA152-25)*vd_temp_coeff/1000)))","v":0.34271236724823584},{"$f":"IF(BB153<I_Vd1,Vd_1+(BB152-25)*vd_temp_coeff/1000,IF(BB153=0,0,IF(Reset=1,0.45,FORECAST(BB153, OFFSET(Vd_1:Vd_3,MATCH(BB153,I_Vd1:I_Vd3,1)-1,0,2), OFFSET(I_Vd1:I_Vd3,MATCH(BB153,I_Vd1:I_Vd3,1)-1,0,2))+(BB152-25)*vd_temp_coeff/1000)))","v":0.34252465724764891},{"$f":"IF(BC153<I_Vd1,Vd_1+(BC152-25)*vd_temp_coeff/1000,IF(BC153=0,0,IF(Reset=1,0.45,FORECAST(BC153, OFFSET(Vd_1:Vd_3,MATCH(BC153,I_Vd1:I_Vd3,1)-1,0,2), OFFSET(I_Vd1:I_Vd3,MATCH(BC153,I_Vd1:I_Vd3,1)-1,0,2))+(BC152-25)*vd_temp_coeff/1000)))","v":0.34234248722565314},{"$f":"IF(BD153<I_Vd1,Vd_1+(BD152-25)*vd_temp_coeff/1000,IF(BD153=0,0,IF(Reset=1,0.45,FORECAST(BD153, OFFSET(Vd_1:Vd_3,MATCH(BD153,I_Vd1:I_Vd3,1)-1,0,2), OFFSET(I_Vd1:I_Vd3,MATCH(BD153,I_Vd1:I_Vd3,1)-1,0,2))+(BD152-25)*vd_temp_coeff/1000)))","v":0.34216561563989878},{"$f":"IF(BE153<I_Vd1,Vd_1+(BE152-25)*vd_temp_coeff/1000,IF(BE153=0,0,IF(Reset=1,0.45,FORECAST(BE153, OFFSET(Vd_1:Vd_3,MATCH(BE153,I_Vd1:I_Vd3,1)-1,0,2), OFFSET(I_Vd1:I_Vd3,MATCH(BE153,I_Vd1:I_Vd3,1)-1,0,2))+(BE152-25)*vd_temp_coeff/1000)))","v":0.34199381478029067},{"$f":"IF(BF153<I_Vd1,Vd_1+(BF152-25)*vd_temp_coeff/1000,IF(BF153=0,0,IF(Reset=1,0.45,FORECAST(BF153, OFFSET(Vd_1:Vd_3,MATCH(BF153,I_Vd1:I_Vd3,1)-1,0,2), OFFSET(I_Vd1:I_Vd3,MATCH(BF153,I_Vd1:I_Vd3,1)-1,0,2))+(BF152-25)*vd_temp_coeff/1000)))","v":0.34182686979337534},{"$f":"IF(BG153<I_Vd1,Vd_1+(BG152-25)*vd_temp_coeff/1000,IF(BG153=0,0,IF(Reset=1,0.45,FORECAST(BG153, OFFSET(Vd_1:Vd_3,MATCH(BG153,I_Vd1:I_Vd3,1)-1,0,2), OFFSET(I_Vd1:I_Vd3,MATCH(BG153,I_Vd1:I_Vd3,1)-1,0,2))+(BG152-25)*vd_temp_coeff/1000)))","v":0.34166457778810688},{"$f":"IF(BH153<I_Vd1,Vd_1+(BH152-25)*vd_temp_coeff/1000,IF(BH153=0,0,IF(Reset=1,0.45,FORECAST(BH153, OFFSET(Vd_1:Vd_3,MATCH(BH153,I_Vd1:I_Vd3,1)-1,0,2), OFFSET(I_Vd1:I_Vd3,MATCH(BH153,I_Vd1:I_Vd3,1)-1,0,2))+(BH152-25)*vd_temp_coeff/1000)))","v":0.33585284350260136},"Vf buck diode"]
[null,null,null,null,null,null,null,"Pdiss buck diode",{"$f":"I154*I106","v":0.15320405439188811},2.2791598318109847E-2,3.3339066233301587E-2,4.3041279889159657E-2,5.1995503973906149E-2,6.0284690040854273E-2,6.8306493310073255E-2,7.5447067372031995E-2,8.211060804760878E-2,8.8343231669837624E-2,9.4185312526352719E-2,9.9672347191125624E-2,0.10483566769027816,0.10970303339737909,0.11429912499824475,0.11864595888019862,0.12276323647979769,0.12666864017241236,0.13037808499235862,0.13390593367570783,0.13726518110234673,0.14046761309175199,0.14352394361232793,0.14644393374698339,0.14923649517969861,0.15190978049978349,0.15447126223965679,0.15692780225063216,0.15928571276556891,0.16155081028649246,0.16372846326082788,0.16582363436491829,{"$f":"AO154*AO106","v":0.16784091809258758},0.16978457424529894,0.17165855783545844,0.17346654584278656,0.17521196120313243,0.17689799435776477,0.17852762264751501,0.18010362779891267,0.18162861171760966,0.18310501077708841,0.18453510876717641,0.18592104864665904,0.18726484322681466,0.18856838489755762,0.18983345449475048,0.19106172939582239,0.19225479092087833,0.19341413110779085,0.19454115892215526,0.23490042479372103,"Pdiss buck diode"]
[null,null,null,null,null,null,null,"Pout",{"$f":"I99*Iout_PreReg","v":4.444},4.444,4.444,4.444,4.444,4.444,4.444,4.444,4.444,4.444,4.444,4.444,4.444,4.4440000000000008,4.444,4.444,4.444,4.4440000000000008,4.444,4.4440000000000017,4.444,4.444,4.4440000000000008,4.444,4.444,4.444,4.4439999999999991,4.444,4.444,4.444,4.444,4.444,{"$f":"AO99*Iout_PreReg","v":4.4440000000000008},4.444,4.4440000000000008,4.444,4.444,4.444,4.4439999999999991,4.444,4.4439999999999991,4.444,4.444,4.444,4.444,4.444,4.444,4.444,4.444,4.444,4.444,4.4440000000000008]
[null,null,null,null,null,null,null,"P loss",{"$f":"I88+I155+I104*dcr*10^-3","v":0.64789098062858697},0.41909725842695544,0.42961658217850179,0.43980689853586052,0.4497274979895986,0.45942892350454911,0.46220740828739898,0.47180072574645449,0.48127548344124954,0.49066091730503747,0.49998258483667046,0.50926291963695258,0.51852168947075161,0.52777637673441935,0.53704249612840194,0.54633386121516625,0.55566280913944954,0.56504039092396297,0.57447653329849213,0.58398017687714898,0.59355939459504725,0.60322149359764654,0.61297310320216181,0.62282025108956929,0.63276842951366929,0.64282265301189356,0.65298750885671841,0.66326720128533523,0.67366559037992257,0.68418622633448389,0.69483237973124024,0.70560706835568188,{"$f":"AO88+AO155+AO104*dcr*10^-3","v":0.71651308100104549},0.72755299864740097,0.73872921334547359,0.75004394508889727,0.7614992569194069,0.77309706847619597,0.78483916817243748,0.79672722415784525,0.80876279420556962,0.8209473346440801,0.83328220843950107,0.84576869252083364,0.85840798442920063,0.87120120836251169,0.88414942067847724,0.89725361491155164,0.91051472635298714,0.9239336362375834,0.93751117557584496,1.4293085858569765]
[null,null,null,null,null,null,null,"Efficiency",{"$f":"I156/(I156+I157)","v":0.87276024111800499},{"$f":"J156/(J156+J157)","v":0.91382091779046204},0.91184850614849478,0.90994588695394318,0.90810123813098464,0.90630456142592786,0.90579130276745867,0.904023626654473,0.90228455544074737,0.90056846346131481,0.89887048017318449,0.89718637433559068,0.8955124588027642,0.89384551179651506,0.89218271144126415,0.89052158103864176,0.88885994308982386,0.88719588048286102,0.88552770357961474,0.8838539221847419,0.88217322157394407,0.88048444191267861,0.87878656051897597,0.87707867652189986,0.87535999754586291,0.87362982811455403,0.87188755951980212,0.87013266094274211,0.86836467164906894,0.86658319410847029,0.86478788791169336,0.86297846437806203,0.86115468176236942,0.85931634098351306,0.85746328180850084,0.85559537943492303,0.8537125414229606,0.85181470493474998,0.84990183424464527,0.84797391848878867,0.84603096962654922,0.84407302058994338,0.84210012360019237,0.84011234863319062,0.8381097820179132,0.83609252515373578,0.83406069333433019,0.83201441466725601,0.82995382907964332,0.82787908740146532,0.82579035051887129,0.75664336975265112]
[]
[]
[]
[null,null,null,null,null,null,null,null,null,null,null,null,null,null,null,null,null,"Minimum off time for regulation",80]
[null,null,null,null,null,null,null,null,null,null,null,"Vin",{"$f":"Vin_min","v":3.5},{"$f":"Vin_max","v":18},null,null,null,"Maximum allowed Buck duty cycle",{"$f":"(1/(fsw*10^3)-t_off_min*10^-9)*fsw*10^3","v":0.84000000000000008},{"$f":"IF(MAX(J12:BG12)>S163,\"Increase Boost Duty Cycle\",\"OK\")","v":"OK"},null,null,"Lx SLEW rate",0.9]
[null,null,null,null,null,null,null,null,null,null,null,"Ta",{"$f":"Ta","v":125},{"$f":"Ta","v":125},null,null,null,null,"-40C","150C","Ohms/C"]
[null,null,null,null,null,null,null,null,null,null,null,"Tjmax",155,155,null,null,"Buck Fet","Vin < 5.5V",{"$f":"1.25*Rds_ON_min40_7V","v":9.9247499999999989E-2},{"$f":"1.1429*Rds_ON_150_7V","v":0.20572199999999999},{"$f":"(Rds_ON_150-Rds_ON_min40)/190","v":5.6039210526315794E-4},null,null,"Pre_Reg","Adj Buck"]
[null,null,null,null,null,null,null,null,null,null,null,"Vin",2,18,null,null,null,"5V ≤ Vin ≤ 7V",{"$f":"1.1667*Rds_ON_min40_7V","v":9.2633646600000008E-2},{"$f":"1.0714*Rds_ON_150_7V","v":0.19285199999999997},{"$f":"(T166-S166)/190","v":5.2746501789473666E-4},null,"C_Vripple",{"$f":"ROUNDUP(2*MAX(J23:BG23)/(8*C48*fsw),0)","v":1},{"$f":"ROUNDUP(2*MAX(J44:BG44)/(8*C114*fsw),0)","v":1}]
[null,null,null,null,null,null,null,null,null,null,null,"5V out",4.75,4.75,null,null,null,"Vin > 7V",{"$f":"Rds_ON_150_7V*0.4411","v":7.9397999999999996E-2},{"$f":"V175","v":0.18},{"$f":"(T167-S167)/190","v":5.2948421052631577E-4},null,"C Istep up",{"$f":"IF(Vin_min_transient>Vreg,ROUNDUP(L_buck*I_step^2/(2*V_transient*D_max_IC*(Vin_min_transient-Vreg)),0),ROUNDUP(L_buck*I_step^2/(2*V_transient*D_max_IC*(0.7)),0))","v":43},{"$f":"IF(Vin_min_transient2>Vout_sync_buck,ROUNDUP(L_buck2*I_step2^2/(2*V_transient2*D_max_IC*(Vin_min_transient2-Vout_sync_buck)),0),ROUNDUP(L_buck2*I_step2^2/(2*V_transient2*D_max_IC*(0.7)),0))","v":15}]
[null,null,null,null,null,null,null,null,null,null,null,"Vin",0,14,null,null,"3V3",null,null,null,{"$f":"(Rds_ON_3V3_150-Rds_ON_3V3_min40)/190","v":9.2473684210526324E-4},null,"C Istep down",{"$f":"ROUNDUP(L_buck*I_step^2/(2*V_transient*D_max_IC*Vreg),0)","v":6},{"$f":"ROUNDUP(L_buck2*I_step2^2/(2*V_transient2*D_max_IC*Vout_sync_buck),0)","v":9}]
[null,null,null,null,null,null,null,null,null,null,null,"Max buck duty",{"$f":"(1/(fsw*10^3)-t_off_min*10^-9)*fsw*10^3","v":0.84000000000000008},{"$f":"(1/(fsw*10^3)-t_off_min*10^-9)*fsw*10^3","v":0.84000000000000008},null,null,"V5CAN",null,null,null,{"$f":"(Rds_ON_V5CAN_150-Rds_ON_V5CAN_min40)/190","v":1.3831578947368422E-3},null,"ESR ="]
[null,null,null,null,null,null,null,null,null,null,null,null,null,null,null,null,null,null,null,null,null,null,"ESL =",1.8,2.8]
[null,null,null,null,null,null,null,null,null,null,null,null,null,null,null,null,null,null,null,null,null,null,"Co_tot_min",{"$f":"C57*C55","v":42.5},{"$f":"C123*C121","v":17}]
[]
[null,null,null,null,null,null,null,null,null,null,null,null,null,null,null,null,null,null,"A4411 Operating at Vin nom"]
[null,null,null,null,null,null,null,null,null,null,null,null,null,null,null,null,null,null,null,"Vout","Pdiss_max","Rds_ON at 150","Rds_ON at -40"]
[null,null,null,null,null,null,null,null,null,null,null,"Boost Duty Cycle Slope ",null,null,null,null,null,null,"Fet Power Loss ",{"$f":"IF(Topology=\"Buck\",I99,Vreg)","v":5.35},{"$f":"IF(Topology=\"Buck\",I111,I33)","v":0.27345305239789502},0.18,null,{"$f":"J31","v":0.60009570381884203}]
[null,null,null,null,null,null,null,null,null,null,null,"Vin",3.5,6.5,null,null,null,null,"3V3 LDO",{"$f":"IF(Topology=\"Buck\",I112,I34)","v":3.3},{"$f":"IF(Topology=\"Buck\",I115,I36)","v":0},0.503,0.32729999999999998,{"$f":"J4","v":153.97578429325696}]
[null,null,null,null,null,null,null,null,null,null,null,"Duty",0.57999999999999996,0.2,null,"Icc",1.4999999999999999E-2,null,"V5A LDO",{"$f":"IF(Topology=\"Buck\",I136,I57)","v":5},{"$f":"IF(Topology=\"Buck\",I139,I59)","v":0},0.69899999999999995,0.2402]
[null,null,null,null,null,null,null,null,null,null,null,null,"m","b",null,"Rds_On at 25°C",{"$f":"Rds_ON_150/Rds_on_coeff_150","v":0.13158971522718002},null,"V5SNR LDO",{"$f":"IF(Topology=\"Buck\",I140,I60)","v":5},{"$f":"IF(Topology=\"Buck\",I143,I62)","v":1.7499999999999984E-2},0.69899999999999995,0.2402]
[null,null,null,null,null,null,null,null,null,null,null,null,{"$f":"(M177-N177)/(M176-N176)","v":-0.12666666666666665},{"$f":"M177-M179*M176","v":1.0233333333333332},null,"Thermal coeff at 150C",{"$f":"(150+40)*(1.34655999666222-0.667409045393858)/0.828125/(Rds_ON_150*1000)+0.667409045393858/0.828125","v":1.5633592613589595},null,"V5CAN LDO",{"$f":"IF(Topology=\"Buck\",I144,I63)","v":5},{"$f":"IF(Topology=\"Buck\",I147,I65)","v":6.9999999999999937E-2},0.503,0.2402]
[null,null,null,null,null,null,null,null,null,null,null,null,null,null,null,null,null,null,"V5P LDO",{"$f":"IF(Topology=\"Buck\",I148,I66)","v":5},{"$f":"IF(Topology=\"Buck\",I151,I68)","v":2.6249999999999971E-2},0.69899999999999995,0.2402]
[null,null,null,null,null,null,null,null,null,null,null,"Dead Time",15,"ns",null,null,null,null,"Adj Buck Hi side",null,null,0.3]
[null,null,null,null,null,null,null,null,null,null,null,null,null,null,null,null,null,null,"Adj Buck Lo side",null,null,0.11]

{"sheet":"Control Loop1","index":1,"n_rows":136,"n_cols":20,"rows_kept":136,"cut":false,"hidden":false,"merged":[[31,16,31,17],[0,1,0,2],[0,4,0,5],[31,2,31,3],[31,4,31,5],[31,6,31,7],[31,14,31,15]]}
[null,"Series RC with Parallel C",null,null,"No feedforward C"]
[null,"Rz",{"$f":"Rz","v":22.1},"kΩ","Cz2",39,"pF"]
[null,"Cz",{"$f":"Cz","v":1.5},"nF","Rz2",0,"kΩ"]
[null,"Cp",{"$f":"Cp","v":22},"pF"]
[null,null,null,null,"AVOL",60,"dB"]
[null,"Ro_EA",1300,"kΩ",null,{"$f":"10^(F5/20)","v":1000},"V/V"]
[null,"Cstray",25,"pF","gm_EA1",750,"uA/V"]
[null,null,null,null,"RFB1",{"$f":"(Vreg-VFB)/VFB*RFB_2","v":56.874999999999993},"kΩ"]
[null,"Cp +Cstray",{"$f":"IF(Type=RCC,Cp+Cstray,IF(Type=RCRC,Cp+Cstray,Cstray))","v":47},"pF","RFB2",10,"kΩ"]
[null,null,null,null,"FB Gain",{"$f":"RFB_2/(RFB_1+RFB_2)","v":0.14953271028037382}]
[null,null,null,null,"VFB",0.8,"V"]
[null,"Series RC"]
[null,"Series RC with Parallel C",null,null,"Ri",{"$f":"1/gm_POWER1","v":0.22222222222222221}]
[null,null,null,null,"gmPOWER1",4.5,"A/V"]
[null,null,null,null,"K",{"$f":"Vreg/(Iout_PreReg*Ri*(1+Vreg*(m_c*(1-Vreg/Vin_nom)-0.5)/(Iout_PreReg*fsw*10^3*L_buck*10^-6)))","v":20.19787517016702}]
[null,null,null,null,"mc",{"$f":"(1+Se/Sn)","v":2.0477819548872178}]
[null,"No feedforward C",null,null,"Se (Slope Comp)",{"$f":"0.00072*fsw+0.0425","v":1.4825000000000002},"A/us"]
[null,"Feedforward RC",null,null,"Sn (Inductor)",{"$f":"(Vin_nom-Vreg)/L_buck","v":1.4148936170212767},"A/us"]
[null,null,null,null,"wn",{"$f":"PI()*fsw*10^3","v":6283185.307179586}]
[null,"Calculated",null,null,"Qp",{"$f":"1/(PI()*(m_c*(1-Vreg/Vin_nom)-0.5))","v":0.50142346942410665}]
["fco",{"$f":"VLOOKUP(MIN(A34:A133),A34:H133,2,FALSE)/1000","v":38.5352859371054}]
["PM",{"$f":"VLOOKUP(MIN(A34:A133),A34:H133,8,FALSE)","v":66.710339269286592}]
[null,null,null,null,"wp",{"$f":"(1/(Vreg/Iout_PreReg*Number_Cout*Co*10^-6)+(m_c*(1-Vreg/Vin_nom)-0.5)/(fsw*10^3*L_buck*10^-6*Number_Cout*Co*10^-6))/(1000)","v":5.2422520710281688},"Rad"]
[null,null,null,null,"wz",{"$f":"1/(ESR*10^-3*Co*10^-6*1000)","v":39215.686274509804},"Rad"]
[]
[]
[]
[]
[]
[]
[]
[null,null,"Error Amplifier",null,"Control to Output",null,"Total System",null,"Error Amp"]
["Calculated","Frequency","Gain","Phase","Gain","Phase","Gain","Phase","ZCz","ZCp","ZT(s)","RFB1 with or without feedforward C","Tv(s)","1 + s/ωP","1 + s/ωZ","fp(s)","fh(s)","fp(s)fh(s)","Gain","Phase"]
[{"$f":"ABS(G34)","v":65.091380588761865},100,{"$f":"20*LOG(IMABS(M34))","v":39.047212147902222},{"$f":"IF(180/PI()*IMARGUMENT(M34)>0,180/PI()*IMARGUMENT(M34),360+180/PI()*IMARGUMENT(M34))","v":129.07352960380092},{"$f":"S34","v":26.044168440859636},{"$f":"T34","v":-6.8451825472246179},{"$f":"C34+E34","v":65.091380588761865},{"$f":"D34+F34","v":122.2283470565763},{"$f":"IMDIV(1,COMPLEX(0,2*PI()*$B34*Cz*10^-9))","v":"-1061032.95394597i"},{"$f":"IMDIV(1,COMPLEX(0,2*PI()*$B34*Cp_Cstray*10^-12))","v":"-33862753.8493394i"},{"$f":"IMDIV(IMPRODUCT(IMDIV(IMPRODUCT(J34,IMSUM(Rz*10^3,I34)),IMSUM(J34,IMSUM(Rz*10^3,I34))),Ro_EA*10^3),IMSUM(IMDIV(IMPRODUCT(J34,IMSUM(Rz*10^3,I34)),IMSUM(J34,IMSUM(Rz*10^3,I34))),Ro_EA*10^3))","v":"503642.422573691-620317.183925498i"},{"$f":"IF($E$1=\"Feedforward RC\",IMDIV(IMPRODUCT(IMSUM(Rz_2*10^3,IMDIV(1,COMPLEX(0,2*PI()*$B34*Cz_2*10^-12))),RFB_1*10^3),IMSUM(IMSUM(Rz_2*10^3,IMDIV(1,COMPLEX(0,2*PI()*$B34*Cz_2*10^-12))),RFB_1*10^3)),RFB_1*10^3)","v":56874.999999999993},{"$f":"IMPRODUCT(-gm_EA1*10^-6,K34,IMDIV(RFB_2*10^3,IMSUM(L34,RFB_2*10^3)))","v":"-56.4832623447131+69.5682823094017i"},{"$f":"COMPLEX(1,2*PI()*B34*1/(1/(Vreg/Iout_PreReg*Number_Cout*Co*10^-6)+(m_c*(1-Vreg/Vin_nom)-0.5)/(fsw*10^3*L_buck*10^-6*Number_Cout*Co*10^-6)))","v":"1+0.119856604032916i"},{"$f":"COMPLEX(1,2*PI()*B34*(ESR*10^-3*Co*10^-6))","v":"1+0.0000160221225333079i"},{"$f":"IMPRODUCT(K,IMDIV(O34,N34))","v":"19.9118679174287-2.38624525570409i"},{"$f":"IMDIV(1,IMSUM(COMPLEX(1,2*PI()*B34/(wn*Qp)),IMPRODUCT(COMPLEX(0,2*PI()*B34/wn),COMPLEX(0,2*PI()*B34/wn))))","v":"0.999999970226787-0.000199432224697281i"},{"$f":"IMPRODUCT(P34,Q34)","v":"19.9113914303884-2.39021625277455i"},{"$f":"20*LOG(IMABS(R34))","v":26.044168440859636},{"$f":"180/PI()*IMARGUMENT(R34)","v":-6.8451825472246179}]
[{"$f":"ABS(G35)","v":64.558889136044996},109.74987654930599,{"$f":"20*LOG(IMABS(M35))","v":38.527280619329616},{"$f":"IF(180/PI()*IMARGUMENT(M35)>0,180/PI()*IMARGUMENT(M35),360+180/PI()*IMARGUMENT(M35))","v":126.63479968401964},{"$f":"S35","v":26.031608516715387},-7.5053366815801033,{"$f":"C35+E35","v":64.558889136044996},119.12946300243954,{"$f":"IMDIV(1,COMPLEX(0,2*PI()*$B35*Cz*10^-9))","v":"-966773.710646764i"},"-30854480.1270244i","449088.159378584-603931.048447543i",56874.999999999993,{"$f":"IMPRODUCT(-gm_EA1*10^-6,K35,IMDIV(RFB_2*10^3,IMSUM(L35,RFB_2*10^3)))","v":"-50.3650272200282+67.7305848726217i"},"1+0.131542474962316i","1+0.000017584259700884i",{"$f":"IMPRODUCT(K,IMDIV(O35,N35))","v":"19.8543732757923-2.61133823484099i"},"0.999999964138059-0.000218876619519731i",{"$f":"IMPRODUCT(P35,Q35)","v":"19.8538010028907-2.61568379929862i"},{"$f":"20*LOG(IMABS(R35))","v":26.031608516715387},{"$f":"180/PI()*IMARGUMENT(R35)","v":-7.5053366815801033}]
[63.990493398310335,120.450354025878,37.973965287035043,124.28406509792244,26.016528111275289,-8.2275598307762507,63.990493398310335,116.05650526714618,"-880888.198732913i","-28113453.1510503i","397775.175247254-583465.108998193i",56874.999999999993,"-44.6103000277295+65.4353393269002i","1+0.144367703881042i","1+0.0000192987033138294i","19.7855601282623-2.85600609291704i","0.999999956804166-0.000240216818548187i","19.7848732129111-2.86075879385668i",26.016528111275289,-8.2275598307762507]
[63.38793688475505,132.19411484660299,37.389503925223096,122.03788712285619,25.998432959531954,-9.0171859278098907,63.38793688475505,113.0207011950463,"-802632.518987084i","-25615931.4570346i","350224.626595381-559652.734038228i",56874.999999999993,"-39.2775282163045+62.7647926024182i","1+0.158443376786512i","1+0.0000211803030625446i","19.7033051953043-3.12143041188193i","0.999999947970465-0.000263637660260621i","19.70248124354-3.12662478275645i",25.998432959531954,-9.0171859278098907]
[62.753142710823298,145.08287784959401,36.776405798557398,119.90976510155652,25.976736912265899,-9.8798500599119947,62.753142710823298,110.02991504164453,"-731328.85814819i","-23340282.7068571i","306765.135156151-533270.580393409i",56874.999999999993,"-34.4035665595684+59.8060463992609i","1+0.173891410423748i","1+0.0000232453564639114i","19.6051324537534-3.40869462711942i","0.999999937330241-0.000289342004628883i","19.6041449465679-3.41436700182253i",25.976736912265899,-9.8798500599119947]
[62.088080269537812,159.228279334109,36.137333233615209,117.91007697738327,25.9507470359226,-10.821454218580218,62.088080269537812,107.08862275880306,"-666359.6180171i","-21266796.3196947i","267543.337673632-505086.603916494i",56874.999999999993,"-30.0048602998466+56.6452266074573i","1+0.190845608269909i","1+0.0000255117500225888i","19.4881743241824-3.71871719982628i","0.999999924514054-0.00031755249018261i","19.486991965192-3.72490543740115i",25.9507470359226,-10.821454218580218]
[61.394641651617356,174.752840000768,35.474994411571068,116.04621654529765,25.919647240046288,-11.848112992843335,61.394641651617356,104.19810355245431,"-607162.066116524i","-19377512.7483998i","232547.530643193-475818.588142934i",56874.999999999993,"-26.0800968945637+53.3628323150955i","1+0.209452819475996i","1+0.0000279991141553586i","19.349137597107-4.05216590153047i","0.999999909076911-0.000348513462381618i","19.3477236034552-4.0589089680331i",25.919647240046288,-11.848112992843335]
[60.674534627070706,191.79102616724899,34.79205390847725,114.32287813034202,25.882480718593456,-12.966073839732166,60.674534627070706,101.35680429060986,"-553223.461571507i","-17656067.9224949i","201638.790495584-446105.391375535i",56874.999999999993,"-22.6136961303459+50.030511182303i","1+0.229874210803947i","1+0.0000307289932204053i","19.184279229705-4.4093503874018i","0.999999890482819-0.000382493089998188i","19.1825905826423-4.41668775874413i",25.882480718593456,-12.966073839732166]
[59.929195792336401,210.49041445120201,34.09106405737495,112.74243538945656,25.838131734961451,-14.181605900883975,59.929195792336401,98.56082948857258,"-504076.613993246i","-16087551.5104227i","174584.407946118-416490.739667351i",56874.999999999993,"-19.5795597696581+46.7092418318525i","1+0.252286662576022i","1+0.0000337250321242393i","18.9893991104725-4.79009095191624i","0.99999986808617-0.000419785687838644i","18.9873857938831-4.79806179800423i",25.838131734961451,-14.181605900883975]
[59.159724915310122,231.01297000831599,33.374417306398826,111.30536529413693,25.785307608911296,-15.500850958980637,59.159724915310122,95.804514335156298,"-459295.83689945i","-14658377.7733867i","151089.67437865-387417.777392829i",56874.999999999993,"-16.944636378914+43.4487226982612i","1+0.276884300727547i","1+0.0000370131811225663i","18.7598591404639-5.19356289224266i","0.999999841109326-0.000460714265920377i","18.7574634111818-5.20220500176662i",25.785307608911296,-15.500850958980637]
[58.366839889944366,253.53644939701101,32.644317705677949,110.01067770119097,25.722522184266417,-16.92963030133458,58.366839889944366,93.081047399856388,"-418493.260621673i","-13356167.892181i","130825.500764381-359231.793607001i",56874.999999999993,"-14.6720187773138+40.2876777877011i","1+0.303880178232891i","1+0.0000406219205889874i","18.4906402914255-5.61811859091743i","0.999999808615625-0.000505633327181101i","18.4877960446102-5.62746699966958i",25.722522184266417,-16.92963030133458]
[57.550851066758518,278.255940220713,31.902768503016269,108.85632209213217,25.64808256374225,-18.473202331395164,57.550851066758518,90.383119760737003,"-381315.4727638i","-12169642.7477809i","113450.671289727-332188.41999481i",56874.999999999993,"-12.7234397708105+37.2547760741843i","1+0.333508120468408i","1+0.0000445825076983707i","18.1764512307075-6.06109361481366i","0.999999769476847-0.000554931937948979i","18.1730835461889-6.07117891089774i",25.64808256374225,-18.473202331395164]
[56.711653881284263,305.38555088334198,31.151572418659747,107.83955374468255,25.560081462624517,-20.135968173912808,56.711653881284263,87.703585570769746,"-347440.457112945i","-11088525.2270089i","98628.5437974683-306464.907311868i",56874.999999999993,"-11.0611450987815+34.3698961471254i","1+0.366024750495987i","1+0.0000489292471615465i","17.811902917452-6.51860905439278i","0.999999722334054-0.00060903709776343i","17.8079278969532-6.52945535405552i",25.560081462624517,-20.135968173912808]
[55.848739376906508,335.16026509388399,30.392341285366825,106.95725047093029,25.456398091539686,-21.921126718509299,55.848739376906508,85.036123752420991,"-316574.804489057i","-10103451.2070976i","86038.6616092962-282172.60468336i",56874.999999999993,"-9.64919569450052+31.6455257588815i","1+0.401711711809249i","1+0.0000536997883563018i","17.3917622158962-6.98538994950518i","0.999999665550395-0.00066841743772774i","17.3870872427766-6.99701257038219i",25.456398091539686,-21.921126718509299]
[54.961223083867011,367.83797718286303,29.6265121663542,106.20617762590904,25.334710917512815,-23.83028692321674,54.961223083867011,82.375890702692288,"-288451.171374971i","-9205888.4481374i","75384.0803292806-259369.321737324i",56874.999999999993,"-8.45428938272307+29.0881482322233i","1+0.440878107794753i","1+0.0000589354514282796i","16.9112927223383-7.45462836489664i","0.999999597154282-0.000733587279417932i","16.9058172891552-7.46703127105114i",25.334710917512815,-23.83028692321674]
[54.047893432428083,403.70172585965503,28.855367627328441,105.58320342331093,25.192525805099638,-25.863053872691978,54.047893432428083,79.720149550618956,"-262825.96431476i","-8388062.69089661i","66395.3207893992-238070.747495059i",56874.999999999993,"-7.44620420068029+26.699523083558i","1+0.483863179037656i","1+0.0000646815851863128i","16.3666813406351-7.91792803319257i","0.999999514770929-0.000805111089492481i","16.3602985873802-7.93110118782924i",25.192525805099638,-25.863053872691978]
[53.107281114414533,443.062145758388,28.080058420361567,105.08546904824668,25.02722269405297,-28.016615650513046,53.107281114414533,77.068853397733633,"-239477.230023748i","-7642890.31990688i","58831.8200158271-218260.488763464i",56874.999999999993,"-6.59796112327034+24.4778118239399i","1+0.531039241661374i","1+0.0000709879598921124i","15.7555338632454-8.36537294875543i","0.999999415539898-0.000883608368571124i","15.7481329412207-8.37928978110157i",25.02722269405297,-28.016615650513046]
[52.137750272553546,486.26015800653499,27.301627366271877,104.7105190820006,24.836122906281666,-30.285369333466008,52.137750272553546,74.425149748534594,"-218202.732935341i","-6963917.00857472i","52481.6353472936-199898.56836746i",56874.999999999993,"-5.88579088007032+22.4185310318647i","1+0.582814912151726i","1+0.0000779091983464639i","15.0774024282789-8.78576137145079i","0.999999296015784-0.000969759016707341i","15.068871742717-8.80037663336681i",24.836122906281666,-30.285369333466008]
[51.137610898702491,533.66992312063098,26.521033664847835,104.45639777924436,24.616577233854656,-32.66063415430493,51.137610898702491,71.795763624939426,"-198818.203533298i","-6345261.81489247i","47160.0114497512-182928.403842421i",56874.999999999993,"-5.28897324670108+20.515335010365i","1+0.639638646597464i","1+0.0000855052490057978i","14.3342849322752-9.16703558967711i","0.999999152048588-0.00106430922190064i","14.3245162169825-9.18228392811911i",24.616577233854656,-32.66063415430493]
[50.105249353976092,585.70208180566704,25.739177209076693,104.32171611427947,24.366072144899395,-35.130505024083142,50.105249353976092,69.191211090196333,"-181155.74229733i","-5781566.24353178i","42707.2759257222-167282.391701571i",56874.999999999993,"-4.78960103839876+18.7606420599893i","1+0.702002625002366i","1+0.0000938419052270395i","13.5310167190184-9.49691384861433i","0.99999897863962-0.00116807792261622i","13.5199097635745-9.51270943074283i",24.366072144899395,-35.130505024083142]
[49.03927075956878,642.80731172843196,24.956922734180562,104.30569349713916,24.082348025388217,-37.679896744078476,49.03927075956878,66.625796753060683,"-165062.365437782i","-5267947.8331207i","38986.4021367674-152886.27287376i",56874.999999999993,"-4.37230678169354+17.1461240606086i","1+0.770447014312981i","1+0.000102991375138192i","12.6754658233422-9.76369459168157i","0.999998769767947-0.00128196390024006i","12.6629335255784-9.77993206967578i",24.082348025388217,-37.679896744078476]
[47.938643746824567,705.48023107186498,24.175123803722983,104.40817682645752,23.763519943101588,-40.290815724775307,47.938643746824567,64.117361101682206,"-150398.679823232i","-4799957.86669888i","35880.4737751934-139662.469869524i",56874.999999999993,"-4.02397836731141+15.6630807330307i","1+0.845564647086308i","1+0.000113032907070598i","11.7784526067085-9.95716009706718i","0.999998518181342-0.00140695356283817i","11.7644258913033-9.9737170782213i",23.763519943101588,-40.290815724775307]
[46.802835561104544,774.26368268112697,23.394646732598137,104.6296382026345,23.408188828506404,-42.942871391253838,46.802835561104544,61.686766811380657,"-137037.675623867i","-4373542.83905959i","33290.2049943996-127532.579812419i",56874.999999999993,"-3.73348093395136+14.3027192312993i","1+0.928006156321794i","1+0.000124053475970073i","10.8533473238614-10.0694675166199i","0.999998215144479-0.00154412948755651i","10.8377793904881-10.0862085177167i",23.408188828506404,-42.942871391253838]
[45.631924696730778,849.75343590864497,22.616394576859548,104.9711512378282,23.015530119871229,-45.614006533961295,45.631924696730778,59.357144703866901,"-124863.626213103i","-3985009.34722668i","31131.6100071344-116419.189647171i",56874.999999999993,"-3.49139551481882+13.0563577174398i","1+1.01848561093313i","1+0.000136148536732277i","9.91535248301058-10.0958939201268i","0.99999785013564-0.00169467979554253i","9.89822185890328-10.1126755628429i",23.015530119871229,-45.614006533961295]
[44.426679729523372,932.60334688321996,21.841331285268424,105.43434451371485,22.585348444254944,-48.281390949494075,44.426679729523372,57.152953564220773,"-113771.085798905i","-3630992.09996506i","29333.8733428583-106247.157177095i",56874.999999999993,"-3.28978018798411+11.9155690292069i","1+1.11778670067155i","1+0.00014942285098736i","8.98053953068511-10.0353096281631i","0.999997410481395-0.00185990844044466i","8.96185151833102-10.051986622815i",22.585348444254944,-48.281390949494075]
[43.18859683999132,1023.53102189903,21.070506004616604,106.02132939958845,22.118090835374712,-50.9223941458106,43.18859683999132,55.098935253777853,"-103663.976102782i","-3308424.76923772i","27837.4426689424-96944.4781160987i",56874.999999999993,"-3.12195618717111+10.8722779195625i","1+1.22676952407158i","1+0.000163991394495082i","8.06476375893339-9.89029412058144i","0.999996880916583-0.00204124649941283i","8.04455007601069-9.90672544272057i",22.118090835374712,-50.9223941458106]
[41.919893979798545,1123.3240329780299,20.305077353521568,106.73459822041825,21.614816626276973,-53.515538358484747,41.919893979798545,53.219059861933502,"-94454.7541757011i","-3014513.43113939i","26592.3468676239-88442.837316499i",56874.999999999993,"-2.98231927487371+9.91882287661672i","1+1.34637803821306i","1+0.000179980353009836i","7.1826098136379-9.66687288943249i","0.999996243054303-0.00224026456414458i","7.16092647618258-9.68292751775956i",21.614816626276973,-53.515538358484747]
[40.623465448000104,1232.84673944207,19.546337218138842,107.57688776961587,21.077128229861263,-56.04133679695537,40.623465448000104,51.535550972660495,"-86063.6541429428i","-2746712.36626413i","25556.7301447814-80677.9228401353i",56874.999999999993,"-2.86617534333997+9.04799134655724i","1+1.4776482348258i","1+0.0001975282152413i","6.34651293646044-9.37392398762587i","0.999995474747524-0.00245868633896822i","6.32343667803616-9.3894856529101i",21.077128229861263,-56.04133679695537]
[39.302805381015943,1353.04777457981,18.795733269223504,108.55100257371217,20.507072111792436,-58.482942847277904,39.302805381015943,50.068059726434264,"-78417.9963102543i","-2502702.00990172i","24695.5861501803-73589.5649452979i",56874.999999999993,"-2.7695984467492+8.253035320968i","1+1.62171711355431i","1+0.000216786972377373i","5.56616063980749-9.02235933016163i","0.999994549320152-0.0026984035633014i","5.54178433388197-9.03732989987381i",20.507072111792436,-58.482942847277904]
[37.961911235795093,1484.9682622544599,18.054888950245893,109.65959239998111,19.9070222855492,-60.826568050558997,37.961911235795093,48.833024349422111,"-71451.5576471059i","-2280368.86107784i","23979.6727699127-67121.7483221043i",56874.999999999993,"-2.68930909569115+7.52767270902105i","1+1.77983253010481i","1+0.000237923434559143i","4.84821959943779-8.62421340833979i","0.999993434640862-0.00296149238715312i","4.82264722678096-8.63851475271646i",19.9070222855492,-60.826568050558997]
[36.605178358773529,1629.75083462064,17.325619151709006,110.9048796100066,19.279559207064523,-63.061661737379417,36.605178358773529,47.843217872627186,"-65103.9981944816i","-2077787.17641962i","23384.5872106311-61222.5347670147i",56874.999999999993,"-2.62257052829508+6.8660786654596i","1+1.95336400457441i","1+0.000261120675710528i","4.19637170063702-8.19176734702671i","0.999992092007529-0.00325023134073409i","4.1697133767939-8.20534174541099i",19.279559207064523,-63.061661737379417]
[35.237294517302075,1788.6495290574401,16.609939203290253,112.28833453499711,18.627355314011822,-65.180875432042768,35.237294517302075,47.107459102954337,"-59320.3384290213i","-1893202.29028792i","22889.9813790505-55843.9245973557i",56874.999999999993,"-2.56710071540754+6.26287004830158i","1+2.143814583579i","1+0.000286579619237019i","3.61159710647186-7.73680624749046i","0.999990474803565-0.00356712105280006i","3.58396458085312-7.7496155569639i",18.627355314011822,-65.180875432042768]
[33.863139677490999,1963.0406500402701,15.910064256606024,113.81030153191892,17.953075420884975,-67.179855537076151,33.863139677490999,46.630445994842773,{"$f":"IMDIV(1,COMPLEX(0,2*PI()*$B66*Cz*10^-9))","v":"-54050.4830566909i"},{"$f":"IMDIV(1,COMPLEX(0,2*PI()*$B66*Cp_Cstray*10^-12))","v":"-1725015.4167029i"},{"$f":"IMDIV(IMPRODUCT(IMDIV(IMPRODUCT(J66,IMSUM(Rz*10^3,I66)),IMSUM(J66,IMSUM(Rz*10^3,I66))),Ro_EA*10^3),IMSUM(IMDIV(IMPRODUCT(J66,IMSUM(Rz*10^3,I66)),IMSUM(J66,IMSUM(Rz*10^3,I66))),Ro_EA*10^3))","v":"22478.8987782713-50941.6781056034i"},{"$f":"IF($E$1=\"Feedforward RC\",IMDIV(IMPRODUCT(IMSUM(Rz_2*10^3,IMDIV(1,COMPLEX(0,2*PI()*$B66*Cz_2*10^-12))),RFB_1*10^3),IMSUM(IMSUM(Rz_2*10^3,IMDIV(1,COMPLEX(0,2*PI()*$B66*Cz_2*10^-12))),RFB_1*10^3)),RFB_1*10^3)","v":56874.999999999993},{"$f":"IMPRODUCT(-gm_EA1*10^-6,K66,IMDIV(RFB_2*10^3,IMSUM(L66,RFB_2*10^3)))","v":"-2.52099799382482+5.71308539502095i"},{"$f":"COMPLEX(1,2*PI()*B66*1/(1/(Vreg/Iout_PreReg*Number_Cout*Co*10^-6)+(m_c*(1-Vreg/Vin_nom)-0.5)/(fsw*10^3*L_buck*10^-6*Number_Cout*Co*10^-6)))","v":"1+2.35283385892395i"},{"$f":"COMPLEX(1,2*PI()*B66*(ESR*10^-3*Co*10^-6))","v":"1+0.000314520778328097i"},{"$f":"IMPRODUCT(K,IMDIV(O66,N66))","v":"3.09261878946472-7.27006554917789i"},{"$f":"IMDIV(1,IMSUM(COMPLEX(1,2*PI()*B66/(wn*Qp)),IMPRODUCT(COMPLEX(0,2*PI()*B66/wn),COMPLEX(0,2*PI()*B66/wn))))","v":"0.999988526879494-0.00391490588717066i"},"3.06412168505808-7.28208945034541i",17.953075420884975,-67.179855537076151]
[32.487692384554379,2154.4346900318801,15.228395720527512,115.46958511622793,17.25929666402687,-69.056916919199452,32.487692384554379,46.412668197028481,"-49248.7871113079i","-1571769.80142472i","22137.2157963575-46475.1128991638i",56874.999999999993,"-2.48267840706813+5.21216219429875i","1+2.5822322555793i","1+0.000345186165937001i","2.63642155137499-6.80088074217487i","0.999986180603609-0.00429659768304723i","2.60716446918101-6.81211440083726i",17.25929666402687,-69.056916919199452]
[31.115940782016605,2364.4894126454101,14.567491324889854,117.26301459203974,16.54844945712675,-70.812649339757016,31.115940782016605,46.450365252282722,"-44873.6605996842i","-1432138.10424524i","21853.1720916377-42406.8887621884i",56874.999999999993,"-2.45082303831451+4.75591275837627i","1+2.83399671271464i","1+0.000378841390981141i","2.23877281330007-6.33702300228296i","0.999983354514056-0.00471550180240088i","2.20885330444955-6.34747445669193i",16.54844945712675,-70.812649339757016]
[29.752794275641605,2595.0242113997401,13.930015844160369,119.1850163726461,15.822778431481234,-72.449501312369819,29.752794275641605,46.735515060276285,"-40887.2082689993i","-1304910.90220211i","21616.9766192952-38702.7884547118i",56874.999999999993,"-2.42433382646302+4.34049963978077i","1+3.1103078936157i","1+0.000415777958919475i","1.89469423130335-5.88468459229817i","0.99997995049088-0.00517524570692682i","1.86420155494117-5.89437211544726i",15.822778431481234,-72.449501312369819]
[28.40299147619384,2848.0358684357998,13.318670725407546,121.227234313019,15.084320750786295,-73.971375313234475,28.40299147619384,47.255858999784522,"-37254.9013762495i","-1188986.21413562i","21420.4775971519-35331.5004186502i",56874.999999999993,"-2.40229655295162+3.9624112619047i","1+3.41355907354653i","1+0.000456315796633345i","1.59885553071845-5.44857119467543i","0.999975850349875-0.00567981030796882i","1.56787006808156-5.45752080971172i",15.084320750786295,-73.971375313234475]
[27.071001404809238,3125.7158496882398,12.736102971099006,123.378247476303,14.334898433710233,-75.383257086346916,27.071001404809238,47.994990389956087,"-33945.2786167941i","-1083359.95585513i","21256.8863216669-32264.4075175627i",56874.999999999993,"-2.3839498678505+3.61843822626872i","1+3.74637686915494i","1+0.000500806023480077i","1.34588050978583-5.03206039296138i","0.99997091174013-0.00623356435551038i","1.31447368816347-5.04030365185356i",14.334898433710233,-75.383257086346916]
[25.760917775221408,3430.4692863149198,12.184796580055345,125.62343861997512,13.576121195166062,-76.690891873813143,25.760917775221408,48.932546746161975,"-30929.6736215864i","-987117.243242122i","21120.5461937152-29475.3845599569i",56874.999999999993,"-2.36865938621105+3.30565060485498i","1+4.11164398896928i","1+0.000549633992520871i","1.13056819737443-4.6373924940842i","0.999964963202913-0.00684130215690082i","1.09880278261373-4.64496457335159i",13.576121195166062,-76.690891873813143]
[24.476349925457129,3764.93580679247,11.666953319754107,127.94506194767682,12.809396605703023,-77.900512621236288,24.476349925457129,50.044549326440531,"-28181.9666627972i","-899424.467961613i","21006.7395915811-26940.6063355237i",56874.999999999993,"-2.35589602896237+3.0213764114606i","1+4.51252420204073i","1+0.000603222628264676i","0.948039776520935-4.26586862070248i","0.999957798220579-0.00750828494251089i","0.915970410423854-4.27280674623486i",12.809396605703023,-77.900512621236288]
[23.220317811377257,4132.0124001153399,11.184372940100445,130.322542985383,12.035944871276813,-79.018619724643244,23.220317811377257,51.303923260739751,"-25678.3584172292i","-819522.077145612i","20911.526340846-24638.3671448814i",56874.999999999993,"-2.3452179073846+2.76318136204278i","1+4.95248974099724i","1+0.000662036089837958i","0.793825194295195-3.9180394085914i","0.999949168049148-0.00824028622403954i","0.761499076448074-3.92438159381759i",12.035944871276813,-79.018619724643244]
[21.995161366386959,4534.8785081285796,10.738345259071549,132.73301689360264,11.256816107315409,-80.051808448231839,21.995161366386959,52.6812084453708,"-23397.1638279639i","-746717.994509489i","20831.6084886512-22548.9122599603i",56874.999999999993,"-2.33625515760574+2.52884997307966i","1+5.43535137686149i","1+0.000726583791309008i","0.663903735295337-3.59387463302347i","0.999938773086142-0.00904364152173303i","0.631361372663412-3.59965869855785i",11.256816107315409,-80.051808448231839]
[20.802475504398537,4977.0235643321103,10.329566975533758,135.1520776512252,10.47290852886478,-81.006638318855806,20.802475504398537,54.145439332369392,"-21318.6242787732i","-680381.625918294i","20764.2169074562-20654.2813628194i",56874.999999999993,"-2.32869722326612+2.31636800330685i","1+5.96529142612648i","1+0.000797424813988901i","0.554711474121947-3.2929093137031i","0.999926252474594-0.00992530286927331i","0.521987443263862-3.29817214917555i",10.47290852886478,-81.006638318855806]
[19.643080511547602,5462.27721768434,9.9580940579223434,137.55467617485041,9.6849864536252586,-81.889538133941087,19.643080511547602,55.665138040909326,"-19424.7364544376i","-619938.397482052i","20707.0159461352-18938.1637359122i",56874.999999999993,"-2.32228216218339+2.12390621337333i","1+6.54689997598012i","1+0.000875172748926349i","0.463126372194153-3.01436540505851i","0.999911171583161-0.0108928985394099i","0.430250056893705-3.01914243233504i",9.6849864536252586,-81.889538133941087]
[18.517033620959261,5994.8425031894103,9.6233362224006402,139.91607901933187,8.8936973985586221,-82.706740301236593,18.517033620959261,57.209338718095282,"-17699.0964046424i","-564864.778871566i","20658.0229291468-17385.7647861164i",56874.999999999993,"-2.31678761822207+1.9498053965738i","1+7.1852146414447i","1+0.000960501011539833i","0.386439457397074-2.7572503677895i","0.999893006929006-0.0119547984692952i","0.35343573857646-2.76157516693892i",8.8936973985586221,-82.706740301236593]
[17.423682022443998,6579.3322465756801,9.3240941783631044,142.21278807205809,8.0995878440808937,-83.464238746779188,17.423682022443998,58.748549325278901,"-16126.7574608077i","-514683.74874918i","20615.5397917797-15983.6833546898i",56874.999999999993,"-2.31202315421829+1.79256261921755i","1+7.88576419878819i","1+0.0010541486744198i","0.322318368857067-2.52043509040814i","0.999871128021831-0.0131201859015114i","0.289208254112425-2.52433915387107i",8.0995878440808937,-83.464238746779188]
[16.361751771806105,7220.8090183854702,9.0586343186203102,144.42332884240804,7.303117453185795,-84.167765357073137,16.361751771806105,60.255563485334903,"-14694.1007751955i","-468960.663038156i","20578.0945440945-14719.7991773719i",56874.999999999993,"-2.30782368718817+1.65081859933143i","1+8.65461647313938i","1+0.00115692686882187i","0.268767724025287-2.30271410731995i","0.999844775501502-0.0143991357943162i","0.235568911563325-2.30622669263283i",7.303117453185795,-84.167765357073137]
[15.329462440066106,7924.8289835391797,8.8247907595123412,146.52883848401044,6.5046716805537654,-84.822780714786532,15.329462440066106,61.706057769223904,"-13388.7173609659i","-427299.490243594i","20544.3905898755-13583.1697987244i",56874.999999999993,"-2.30404380447202+1.52334614565134i","1+9.49843089508634i","1+0.00126972581029775i","0.224089314008054-2.10285110001607i","0.999813034814203-0.0158027005917239i","0.190816690785294-2.10599915640453i",6.5046716805537654,-84.822780714786532]
[14.324654868340943,8697.4900261778293,8.6200820648958665,148.51341803439701,5.7045728034450764,-85.434475655032429,14.324654868340943,63.078942379364577,"-12199.300611469i","-389339.381217097i","20513.2622001452-12563.9362008827i",56874.999999999993,"-2.30055277010974+1.40903957393077i","1+10.4245161814783i","1+0.00139352250931645i","0.186844033655857-1.91961245856816i","0.999774804519023-0.0173430039793304i","0.15351011071611-1.92242060733647i",5.7045728034450764,-85.434475655032429]
[13.344919352314331,9545.4845666183501,8.4418298872721333,150.36424807392109,4.9030894650421972,-86.007780863815256,13.344919352314331,64.356467210105833,"-11115.5483678275i","-354751.543654068i","20483.6346630835-11653.236369529i",56874.999999999993,"-2.29723005567292+1.30690501340512i","1+11.4408936400349i","1+0.00152938923366159i","0.155816653755401-1.7517913501336i","0.99972875813305-0.0190333432833709i","0.122431943627402-1.75428190283748i",4.9030894650421972,-86.007780863815256]
[12.387713569553226,10476.157527896699,8.2872687168574526,152.07149569587094,4.1004448526957731,-86.547382341156293,12.387713569553226,65.524113354714643,"-10128.0736865647i","-323236.394252064i","20454.4878122718-10843.125980735i",56874.999999999993,"-2.29396124997441+1.21605151185813i","1+12.5563666460757i","1+0.00167850279590197i","0.129983983985606-1.5982243710965i","0.999673298202582-0.0208883011957094i","0.0965573259426154-1.6004173729299i",4.1004448526957731,-86.547382341156293]
[11.450462759899082,11497.5699539774,8.1536391132098771,153.62805900292088,3.2968236466892047,-87.057741055240271,11.450462759899082,66.570317947680607,"-9228.32353439107i","-294520.963863544i","20424.8217815611-10126.5053437251i",56874.999999999993,"-2.29063421849284+1.13568284228693i","1+13.7805968931462i","1+0.00184215474637906i","0.10848660045984-1.45780249763337i","0.999606501023674-0.0229238675226795i","0.0750254397636353-1.45971578629979i",3.2968236466892047,-87.057741055240271]
[10.53063817181199,12618.568830660201,8.0382602958143003,155.02920249755533,2.4923778759976907,-87.543115526509681,10.53063817181199,67.486086971045651,"-8408.50470592118i","-268356.533167698i","20393.6239561918-9497.05166929512i",56874.999999999993,"-2.28713539695609+1.06508990683684i","1+15.1241880779854i","1+0.00202176255999818i","0.0906040722152155-1.32947772100373i","0.99952605011866-0.0251575716559521i","0.057114699394797-1.33112699363469i",2.4923778759976907,-87.543115526509681]
[9.6258128849550619,13848.863713938699,7.9385810742995169,156.27213463647431,1.6872318106555451,-88.007586412410333,9.6258128849550619,68.264548224063972,"-7661.51632265725i","-244516.478382678i","20359.8361956946-8949.15564438369i",56874.999999999993,"-2.283346115405+1.0036436236692i","1+16.5987777446737i","1+0.00221888191371808i","0.0757334780068357-1.21226646935598i","0.999429156196626-0.0276086264422282i","0.0422212339193194-1.21366535185737i",1.6872318106555451,-88.007586412410333]
[8.7336964130157018,15199.1108295293,7.852210404063297,157.35557073147868,0.88148600895240503,-88.455082426420162,8.7336964130157018,68.900488305058516,"-6980.88832857618i","-222794.308358814i","20322.3215058747-8477.86117298513i",56874.999999999993,"-2.27913886047193+0.950788168932913i","1+18.217138083473i","1+0.00243522016108046i","0.0633709283447543-1.10525067930888i","0.999312460873416-0.0302980840765314i","0.0298403803446854-1.10641079393717i",0.88148600895240503,-88.455082426420162]
[7.8521508806923936,16681.0053720006,7.776930256776259,158.27931363129778,7.5220623916134766E-2,-88.889407130850586,7.8521508806923936,69.389906500447196,"-6360.7254495999i","-203001.876051061i","20279.8294489514-8078.80698530942i",56874.999999999993,"-2.27437339614408+0.906034428259001i","1+19.9932865574283i","1+0.00267265112048962i","0.0530957757223453-1.00757718530074i","0.999171920887547-0.0332490045491796i","0.0195508698017963-1.00850821336794i",7.5220623916134766E-2,-88.889407130850586]
[6.9791921623761306,18307.3828029537,7.7106941035895895,159.04387381983472,-0.73150194121345913,-89.314266302387153,6.9791921623761306,69.729607517447562,"-5795.65613155139i","-184967.748879299i","20230.9597209325-7748.16861490445i",56874.999999999993,"-2.26889267898309+0.868953489521995i","1+21.9426073149264i","1+0.00293323130533099i","0.0445571924725761-0.918455937731028i","0.99900266890677-0.0364866370231004i","0.0110013857773928-0.919165675175082i",-0.73150194121345913,-89.314266302387153]
[6.1129793756736603,20092.330025650499,7.6516143293866623,159.65014133534299,-1.5386349537130017,-89.733295691641175,6.1129793756736603,69.916845643701819,"-5280.78601432198i","-168535.72386134i","20174.1235173358-7482.5989936279i",56874.999999999993,"-2.26251852530869+0.839169980593784i","1+24.0819844398307i","1+0.00321921773650635i","0.0374628094620879-0.837157436550801i","0.998798846258936-0.0400386142847439i","0.00389918717068926-0.837651840742104i",-1.5386349537130017,-89.733295691641175]
[5.2517957655864418,22051.307399030498,7.597941553675974,160.09911497122795,-2.3461457880895327,-90.150089090753198,5.2517957655864418,69.94902588047475,"-4811.65553926576i","-153563.474657418i","20107.502583524-7279.16561774158i",56874.999999999993,"-2.25504701871297+0.816355022550458i","1+26.4299481933372i","1+0.00353308749166907i","0.0315691322432824-0.763009669576557i","0.998553402020693-0.0439351600702511i","-0.00199948756762464-0.763292896208743i",-2.3461457880895327,-90.150089090753198]
[4.3940234872444739,24201.282647943801,7.5480383199021617,160.39168963818801,-3.1540148326576878,-90.568226692467192,4.3940234872444739,69.82346294572082,"-4384.20132263575i","-139921.318807524i","20029.0062438902-7135.28190400999i",56874.999999999993,"-2.24624369090358+0.800218531290841i","1+29.0068355142329i","1+0.00387755916048575i","0.0266734792501469-0.695394769312888i","0.99825785183784-0.0482093085816634i","-0.00689749092258681-0.695469198585671i",-3.1540148326576878,-90.568226692467192]
[3.5381142378446482,26560.877829466801,7.500349071286962,160.52850025545334,-3.9622348334423139,-90.991303774841981,3.5381142378446482,69.537196480611357,"-3994.72096049797i","-127491.094483978i","19936.2272741061-7048.63000535466i",56874.999999999993,"-2.23583857279695+0.790500561348187i","1+31.8349661677307i","1+0.00425561639175939i","0.0226072158810155-0.633745544065837i","0.997901988609611-0.0528971348270168i","-0.0109635378058796-0.6336117956423i",-3.9622348334423139,-90.991303774841981]
[2.6825571932816628,29150.530628251799,7.453367849338135,160.50981964690538,-4.7708106560564723,-91.42295978144476,2.6825571932816628,69.086859865460625,"-3639.84096027964i","-116165.137030201i","19826.3982801719-7017.07203590942i",56874.999999999993,"-2.22352130244919+0.786961349821618i","1+34.9388360685977i","1+0.00467053373636797i","0.0192300868577315-0.577541994921962i","0.997473535724515-0.0580379934793655i","-0.0143378758050696-0.577198931359856i",-4.7708106560564723,-91.42295978144476]
[1.8258453243953303,31992.671377973798,7.4056047835825751,160.335508175005,-5.5797594591872448,-91.866907889952927,1.8258453243953303,68.468600285052077,"-3316.48752119045i","-105845.346420972i","19696.3513387257-7038.54644226728i",56874.999999999993,"-2.20893659873559+0.789369694459883i","1+38.3453294530502i","1+0.0051259050098575i","0.0164254759379287-0.526307896739789i","0.996957731868347-0.0636747626700129i","-0.0171370251803242-0.52575261528019i",-5.5797594591872448,-91.866907889952927]
[0.96644092821981697,35111.917342151297,7.3555522145590153,160.0050138210056,-6.3891112863391983,-92.326965174077628,0.96644092821981697,67.678048646927977,"-3021.85991043051i","-96442.3375669315i","19542.4850902383-7110.94627380268i",56874.999999999993,"-2.19168057086785+0.797489301734881i","1+42.0839517371471i","1+0.00562567442035328i","0.0140964463037966-0.479607496223962i","0.996336834522293-0.0698540874027522i","-0.0194577352719056-0.478835308993119i",-6.3891112863391983,-92.326965174077628]
[0.10274112223116028,38535.2859371054,7.3016512180497948,159.51742273449676,-7.1989100958186345,-92.807083465210169,0.10274112223116028,66.710339269286592,{"$f":"IMDIV(1,COMPLEX(0,2*PI()*$B98*Cz*10^-9))","v":"-2753.40620458276i"},{"$f":"IMDIV(1,COMPLEX(0,2*PI()*$B98*Cp_Cstray*10^-12))","v":"-87874.6661037051i"},{"$f":"IMDIV(IMPRODUCT(IMDIV(IMPRODUCT(J98,IMSUM(Rz*10^3,I98)),IMSUM(J98,IMSUM(Rz*10^3,I98))),Ro_EA*10^3),IMSUM(IMDIV(IMPRODUCT(J98,IMSUM(Rz*10^3,I98)),IMSUM(J98,IMSUM(Rz*10^3,I98))),Ro_EA*10^3))","v":"19360.7452894204-7231.97653184356i"},{"$f":"IF($E$1=\"Feedforward RC\",IMDIV(IMPRODUCT(IMSUM(Rz_2*10^3,IMDIV(1,COMPLEX(0,2*PI()*$B98*Cz_2*10^-12))),RFB_1*10^3),IMSUM(IMSUM(Rz_2*10^3,IMDIV(1,COMPLEX(0,2*PI()*$B98*Cz_2*10^-12))),RFB_1*10^3)),RFB_1*10^3)","v":56874.999999999993},{"$f":"IMPRODUCT(-gm_EA1*10^-6,K98,IMDIV(RFB_2*10^3,IMSUM(L98,RFB_2*10^3)))","v":"-2.17129853713126+0.81106278861797i"},{"$f":"COMPLEX(1,2*PI()*B98*1/(1/(Vreg/Iout_PreReg*Number_Cout*Co*10^-6)+(m_c*(1-Vreg/Vin_nom)-0.5)/(fsw*10^3*L_buck*10^-6*Number_Cout*Co*10^-6)))","v":"1+46.1870850785885i"},{"$f":"COMPLEX(1,2*PI()*B98*(ESR*10^-3*Co*10^-6))","v":"1+0.00617417073140361i"},{"$f":"IMPRODUCT(K,IMDIV(O98,N98))","v":"0.0121624365395237-0.437042361501726i"},{"$f":"IMDIV(1,IMSUM(COMPLEX(1,2*PI()*B98/(wn*Qp)),IMPRODUCT(COMPLEX(0,2*PI()*B98/wn),COMPLEX(0,2*PI()*B98/wn))))","v":"0.995589527128891-0.0766266149598593i"},"-0.0213802823128208-0.436046764364485i",-7.1989100958186345,-92.807083465210169]
[{"$f":"ABS(G99)","v":0.76695588298778805},42292.428743894998,{"$f":"20*LOG(IMABS(M99))","v":7.2422593799039801},{"$f":"IF(180/PI()*IMARGUMENT(M99)>0,180/PI()*IMARGUMENT(M99),360+180/PI()*IMARGUMENT(M99))","v":158.8715615816586},{"$f":"S99","v":-8.0092152628917681},-93.311381010888837,{"$f":"C99+E99","v":-0.76695588298778805},65.560180570769759,"-2508.80118607312i","-80068.1229597805i","19146.6269747649-7398.98886591008i",56874.999999999993,"-2.14728526819794+0.829793143840384i","1+50.6902688554735i","1+0.00677614475565881i","0.0105565060489022-0.398248403883506i","0.994690212543339-0.0840472115893275i",{"$f":"IMPRODUCT(P99,Q99)","v":"-0.0229712146208114-0.397021034401466i"},{"$f":"20*LOG(IMABS(R99))","v":-8.0092152628917681},{"$f":"180/PI()*IMARGUMENT(R99)","v":-93.311381010888837}]
[1.6444826986095897,46415.888336127799,7.1756209043152452,158.06615397152089,-8.820103602924835,-93.844175005871847,-1.6444826986095897,64.221978965649043,"-2285.9262032482i","-72955.0915930275i","18895.208780382-7608.79395290782i",56874.999999999993,"-2.11908883518303+0.85332268630742i","1+55.6325074913933i","1+0.00743681050413779i","0.00922304019447726-0.362893082485917i","0.993608172856653-0.0921751456909795i","-0.02428563463257-0.36142366770479i",-8.820103602924835,-93.844175005871847]
[2.5318314682862555,50941.380148163902,7.0998405121374821,157.10003345152577,-9.6316719804237376,-94.41001503606779,-2.5318314682862555,62.690018415457985,"-2082.85081962824i","-66473.9623285608i","18601.2321580068-7857.45529810898i",56874.999999999993,"-2.0861194943559+0.88120993997484i","1+61.0566082930874i","1+0.00816189034749703i","0.00811583957017829-0.330672795214578i","0.99230657307456-0.101074217373973i","-0.025369093031671-0.328949090361252i",-9.6316719804237376,-94.41001503606779]
[3.4311775144503223,55908.101825122198,7.0128630720789129,155.97241460451517,-10.444040586529235,-95.013717422455869,-3.4311775144503223,60.958697182059296,"-1897.81609338988i","-60568.5987252088i","18259.2398284437-8140.07325442678i",56874.999999999993,"-2.0477652144049+0.912905411711415i","1+67.0095522268564i","1+0.00895766458046765i","0.00719652989060601-0.301310454544185i","0.990741283636613-0.11081280729031i","-0.0262591580724122-0.299318174188164i",-10.444040586529235,-95.013717422455869]
[4.3448955347658771,61359.072734131798,6.9124614521669248,154.68322117719532,-11.257356986932802,-95.660400376722194,-4.3448955347658771,59.022820800473127,"-1729.21934225345i","-55187.8513485145i","17863.7877440996-8450.57490754263i",56874.999999999993,"-2.00341544793641+0.947728027014128i","1+73.5429008452175i","1+0.00983102581876414i","0.00643323923726642-0.27455324305776i","0.988859494651702-0.12146380863418i","-0.0269867128735245-0.272275986924696i",-11.257356986932802,-95.660400376722194]
[5.275565475535462,67341.506577508306,6.7962355879903456,153.23346547990107,-12.071801063525808,-96.355519776336138,-5.275565475535462,56.877945703564933,"-1575.60026181586i","-50285.1147388041i","17409.7420055422-8781.53384883022i",56874.999999999993,"-1.9524944305281+0.98484491762582i","1+80.7132428884044i","1+0.010789538699624i","0.00579949808053975-0.250170541406748i","0.986598093461251-0.133104394634156i","-0.0275770247199515-0.247589717873259i",-12.071801063525808,-96.355519776336138]
[6.2259649022534775,73907.220335257705,6.661626094158378,151.62566623740454,-12.887590996411856,-97.104905225976808,-6.2259649022534775,54.520761011427737,"-1435.62827709243i","-45817.9237369925i","16892.6651508385-9124.05278089239i",56874.999999999993,"-1.89450450289778+1.02325825580102i","1+88.5826844289648i","1+0.0118415054030769i","0.00527332481384589-0.227952019918134i","0.98388177740824-0.145815559184421i","-0.0280506230608833-0.225046771327344i",-12.887590996411856,-97.104905225976808]
[7.1990447562131648,81113.083078968702,6.5059457017781961,149.86428274060353,-13.704990457991361,-97.91479588408329,-7.1990447562131648,51.949486856520238,"-1308.09101771287i","-41747.5856716874i","16309.2838468226-9467.74940616981i",56874.999999999993,"-1.82907856226048+1.06180367171998i","1+97.2193868048499i","1+0.0129960375614562i","0.00483646568957297-0.207705884269886i","0.980620876507823-0.159681349850753i","-0.0284240167484506-0.204453019658386i",-13.704990457991361,-97.91479588408329]
[8.1978860547340844,89021.5085445039,6.3264311623921996,147.95613230612116,-14.524317217126283,-98.791875284711253,-8.1978860547340844,49.164257021409909,"-1191.88381694917i","-38038.8452217821i","15658.011945829-9800.88907656523i",56874.999999999993,"-1.75603872289671+1.09916513008208i","1+106.698157000315i","1+0.0142631351799996i","0.00447376320852849-0.189257265304956i","0.976708867558174-0.17478768975631i","-0.028710275975125-0.185631208008896i",-14.524317217126283,-98.791875284711253]
[9.2256365649498449,97700.995729922506,6.1203168128740906,145.91074736157225,-15.345953377823935,-99.743304059696456,-9.2256365649498449,46.167443301875792,"-1086.00014362086i","-34659.5790517296i","14939.480573953-10110.7024131595i",56874.999999999993,"-1.67545576530314+1.13391055100854i","1+117.10109558823i","1+0.0156537732521101i","0.00417263133755138-0.172446743024829i","0.972019574182146-0.191220657348619i","-0.0289195002228904-0.168419503031332i",-15.345953377823935,-99.743304059696456]
[10.285428853932988,107226.722201033,5.8849286476471407,143.74062059236616,-16.170357501580128,-100.77674904510216,-10.285428853932988,42.963871547263992,"-989.52288400339i","-31580.5175745764i","14157.0043918615-10383.9090045774i",56874.999999999993,"-1.58770142712466+1.16455054256943i","1+128.518307845967i","1+0.0171799968194992i","0.00392261954449225-0.15712899499755i","0.966404069227019-0.2090640606647i","-0.0290591902525244-0.152670178929598i",-16.170357501580128,-100.77674904510216]
[11.380284273391364,117681.1952435,5.6177946091059452,141.46128485985381,-16.99807888249731,-101.90040671678207,-11.380284273391364,39.560878143071733,"-901.616398227882i","-28774.9914328048i","13316.8971340045-10607.437897412i",56874.999999999993,"-1.49348379072948+1.18961920344808i","1+141.048684204205i","1+0.0188550253005749i","0.00371505065833859-0.14317155975927i","0.959687330730064-0.228396106021943i","-0.0291345396922773-0.138248435125872i",-16.99807888249731,-101.90040671678207]
[12.513010953489985,129154.966501488,5.3167633014793703,139.09118225846265,-17.829774254969355,-103.12301821817572,-12.513010953489985,35.968164040286936,"-821.519282368244i","-26218.7005011141i","12428.5482341801-10769.2946037669i",56874.999999999993,"-1.39385587673048+1.2077713574318i","1+154.800756788534i","1+0.0206933669907212i","0.003542720080542-0.130453706228795i","0.951664755286981-0.249284921863547i","-0.029148660125556-0.125031341112968i",-17.829774254969355,-103.12301821817572]
[13.686107022060273,141747.41629268101,4.9801201862961006,136.65129554138335,-18.666227208356375,-104.45387239430555,-13.686107022060273,32.197423147077799,"-748.537773524664i","-23889.5034103615i","11504.1927067642-10859.4809492732i",56874.999999999993,"-1.29018983627262+1.21788571393718i","1+169.893639472808i","1+0.0227109447262115i","0.00339964597274531-0.118865400652191i","0.942098709340525-0.271782660593073i","-0.029102752758576-0.112906905367221i",-18.666227208356375,-104.45387239430555]
[14.901682111159438,155567.614393047,4.6066884408816824,134.16454424810121,-19.508370552041121,-105.90279220777121,-14.901682111159438,28.261752040329995,"-682.039740781286i","-21767.2257696154i","10558.3501590734-10870.8410645902i",56874.999999999993,"-1.1841140365316+1.21915974556152i","1+186.458059586528i","1+0.024925233800198i","0.00328086179466277-0.108306363120768i","0.930715406829797-0.295917871620425i","-0.0289962398376747-0.101773266453559i",-19.508370552041121,-105.90279220777121]
[16.161409929644307,170735.26474706901,4.1959018746342691,131.65498270326592,-20.357311804278577,-107.48009867316748,-16.161409929644307,24.17488403009844,"-621.449209990571i","-19833.485425231i","9606.96918097965-10799.6977498177i",56874.999999999993,"-1.07741710440893+1.21118105605432i","1+204.637490212446i","1+0.0273554133253431i","0.00318224402155249-0.0986852062404606i","0.917202548272745-0.321685829179815i","-0.02882687007145-0.0915380054472975i",-20.357311804278577,-107.48009867316748]
[17.466521866027193,187381.74228603899,3.7478399855414195,129.14687012060804,-21.214361851568611,-109.19654501325662,-17.466521866027193,19.950325107351418,"-566.241374960799i","-18071.5332434298i","8666.37538374209-10646.1667084058i",56874.999999999993,"-0.971929949578553+1.19396262150346i","1+224.589392881757i","1+0.0300225323541165i","0.0031003690820213-0.0899186490597855i","0.901208347828362-0.349036527003305i","-0.02859081448259-0.0821175792149447i",-21.214361851568611,-109.19654501325662]
[18.817846523129031,205651.23083486501,3.2632200960626379,126.66370591867165,-22.08106661919167,-111.06321215601396,-18.817846523129031,15.600493762657692,"-515.938051835909i","-16466.1080373162i","7752.16619947565-10414.0897665063i",56874.999999999993,"-0.869401816763625+1.1679353009166i","1+246.486581430563i","1+0.032949692195618i","0.00303239456444925-0.0819307998771999i","0.882342812954547-0.377860145409761i","-0.0282827724051526-0.0734368734823272i",-22.08106661919167,-111.06321215601396]
[20.215893748495851,225701.97196339199,2.743347531929365,124.22732966509902,-22.959241280425218,-113.09135505642217,-20.215893748495851,11.135974608676847,"-470.103537295661i","-15003.3043817765i","6878.20814370029-10110.5987210753i",56874.999999999993,"-0.771387829200033+1.13389892198975i","1+270.518718830646i","1+0.036162246508067i","0.00297596057812019-0.074652502040835i","0.860182418158284-0.407969991524193i","-0.0278961116584281-0.0654288723388837i",-22.959241280425218,-113.09135505642217]
[21.660975483353081,247707.63559917099,2.1900305974413783,121.85717299069293,-23.851006080794459,-115.29218782832895,-21.660975483353081,6.5649851623639819,"-428.340834701956i","-13670.452171339i","6055.86817985833-9745.38857986667i",56874.999999999993,"-0.679162786526169+1.09294077531215i","1+296.893959959398i","1+0.0396880209000591i","0.00292910785160256-0.0680207373200762i","0.834279604787451-0.439083256439285i","-0.0274230719070855-0.0580344360626877i",-23.851006080794459,-115.29218782832895]
[23.153350898080419,271858.82427329401,1.6054713357750228,119.56972382811531,-24.75882223385544,-117.6765946220461,-23.153350898080419,1.8931292060692186,"-390.288215503843i","-12456.0068777822i","5293.5584637297-9329.82376194846i",56874.999999999993,"-0.593670108081836+1.04633537517179i","1+325.840754537784i","1+0.0435575539426775i","0.00289020972976567-0.0619780818672744i","0.804178789266641-0.470800475435557i","-0.026855065048487-0.0512021709519756i",-24.75882223385544,-117.6765946220461]
[24.693380586792717,298364.72402833402,0.99214494696631739,117.37822879225669,-25.685525533759034,-120.25475305870322,-24.693380586792717,-2.8765242664465234,"-355.616086117878i","-11349.4495569535i","4596.61024478931-8876.01332811196i",56874.999999999993,"-0.515507691004409+0.995440747077978i","1+357.609825852544i","1+0.0478043616799858i","0.0028579157118054-0.0564722101981123i","0.769440677967694-0.502585363103948i","-0.0261831096648347-0.0448883623069078i",-25.685525533759034,-120.25475305870322]
[26.281674124053716,327454.916287773,0.35268020128475525,115.29262586165362,-26.634354325338471,-123.03565850260777,-26.281674124053716,-7.743032640954155,"-324.024133146168i","-10341.1957387075i","3967.43640989271-8395.9732348584i",56874.999999999993,"-0.44494613942722+0.941604474937392i","1+392.476342401354i","1+0.0524652279289679i","0.00283110457228063-0.0514554430007986i","0.729676521349777-0.533747737722226i","-0.025398435759292-0.0390569243140443i",-26.634354325338471,-123.03565850260777]
[27.919216521279765,359381.36638046301,-0.31024920816260304,113.31967344489928,-27.608967313117162,-126.02654138120326,-27.919216521279765,-12.706867936303979,"-295.238722205396i","-9422.51241081048i","3405.90567529784-7900.95568865308i",56874.999999999993,"-0.381970729939945+0.886088488447075i","1+430.742301270716i","1+0.0575805228833541i","0.00280884543913996-0.0468843349379692i","0.684593293502936-0.563433491956312i","-0.0244932878020278-0.0336792988630193i",-27.608967313117162,-126.02654138120326]
[29.607461277241811,394420.60594376602,-0.99401579629664671,111.46322678085224,-28.613445480945163,-129.23217713867481,-29.607461277241811,-17.768950357822575,"-269.010527836683i","-8585.44237776647i","2909.83856086249-7400.98182483901i",56874.999999999993,"-0.326337034863083+0.830016653252974i","1+472.739143890249i","1+0.0631945527809259i","0.00279036547847597-0.0427192989319646i","0.634049426357634-0.590626829941947i","-0.0234619344745728-0.0287342116991441i",-28.613445480945163,-129.23217713867481]
[31.348380118602261,432876.12810830597,-1.6961087856438486,109.72460837001623,-29.652271332958414,-132.65410017195003,-31.348380118602261,-22.929491801933807,"-245.112373967755i","-7822.73533939644i","2475.54221685159-6904.57573166176i",56874.999999999993,"-0.277630902824478+0.774344941868609i","1+518.830626819792i","1+0.0693559436629519i","0.00277502306477916-0.0389242637253115i","0.578118467141903-0.614170914583285i","-0.022301858571162-0.0242071741331894i",-29.652271332958414,-132.65410017195003]
[33.144461852283492,475081.01621027902,-2.4141837830355173,108.10302334253487,-30.730278069247973,-136.28974979468339,-33.144461852283492,-28.18672645214852,"-223.33726622247i","-7127.78509220653i","2098.32016840577-6418.6716635522i",56874.999999999993,"-0.235325626363264+0.719851027688098i","1+569.415972434709i","1+0.0761180625496955i","0.00276228550567977-0.0354663617852359i","0.517154830415607-0.632813086224602i","-0.0210150485662241-0.0200896107303849i",-30.730278069247973,-136.28974979468339]
[34.998655115312943,521400.82879996998,-3.1460935113577158,106.59597995517248,-31.85256160395523,-140.13159754792372,-34.998655115312943,-33.535617592751237,"-203.496599034564i","-6494.57230961374i","1772.91610812847-5948.65329134472i",56874.999999999993,"-0.198831713061137+0.667138686879782i","1+624.933326799124i","1+0.0835394796800144i","0.002751710548133-0.0323156448753618i","0.451851989975031-0.645279202956027i","-0.0196092476811743-0.0163775100335236i",-31.85256160395523,-140.13159754792372]
[36.914252662377727,572236.76593502203,-3.8899026546862459,105.19968659796675,-33.024350007691481,-144.16632913012245,-36.914252662377727,-38.966642532155703,"-185.418522036463i","-5917.61240541902i","1493.87210710452-5498.48166067171i",56874.999999999993,"-0.167537058740694+0.616652148860379i","1+685.863554677505i","1+0.0916844758187478i","0.00274293102418136-0.02944482485097i","0.38327983387125-0.650377738137236i","-0.0180989484391524-0.0130695488526214i",-33.024350007691481,-144.16632913012245]
[38.89471874129859,628029.14418342605,-4.6438903089018089,103.90940744584944,-34.25082843239678,-148.37417687475576,-38.89471874129859,-44.464769428906322,"-168.946451573604i","-5391.9080289448i","1255.79791091072-5070.87338445504i",56874.999999999993,"-0.140837148887184+0.568696080499631i","1+752.734404555242i","1+0.100623599025954i","0.00273564210335737-0.0268290374478048i","0.312885913442144-0.647127807943032i","-0.0165058723144597-0.0101647379662922i",-34.25082843239678,-148.37417687475576]
[40.943466439241817,689261.21043497103,-5.4065434337997402,102.71976787042102,-35.536923005442077,-152.72851390878805,-40.943466439241817,-50.008746038367022,"-153.937714451737i","-4912.90578037457i","1053.55856148441-4667.4988310518i",56874.999999999993,"-0.118156100353392+0.52345781282824i","1+826.125079743529i","1+0.110434275710453i","0.00272959070923921-0.0244456270299014i","0.242446746590271-0.634896981265797i","-0.0148586744194559-0.00765977164314592i",-35.536923005442077,-152.72851390878805]
[43.063598485902773,756463.32755462895,-6.1765442925346399,101.62500742971478,-36.887054193368137,-157.19582138996969,-43.063598485902773,-55.57081396025491,"-140.262312169964i","-4476.45677138182i",{"$f":"IMDIV(IMPRODUCT(IMDIV(IMPRODUCT(J130,IMSUM(Rz*10^3,I130)),IMSUM(J130,IMSUM(Rz*10^3,I130))),Ro_EA*10^3),IMSUM(IMDIV(IMPRODUCT(J130,IMSUM(Rz*10^3,I130)),IMSUM(J130,IMSUM(Rz*10^3,I130))),Ro_EA*10^3))","v":"882.393118109529-4289.17896798104i"},56874.999999999993,{"$f":"IMPRODUCT(-gm_EA1*10^-6,K130,IMDIV(RFB_2*10^3,IMSUM(L130,RFB_2*10^3)))","v":"-0.098959975862751+0.481029416969837i"},"1+906.671255161374i","1+0.121201481260341i",{"$f":"IMPRODUCT(K,IMDIV(O130,N130))","v":"0.00272456673277536-0.0222739504406587i"},"0.173961681166329-0.613526552061167i","-0.0131916898053552-0.00554640789829271i",-36.887054193368137,-157.19582138996969]
[45.257631978511398,830217.56813197501,-6.9527543141648271,100.61918274044558,-38.30487766434657,-161.73611879744487,-45.257631978511398,-61.116936056999293,"-127.801794935915i","-4078.7806894441i","737.979045640409-3936.06746012513i",56874.999999999993,"-0.0827640051185506+0.441428126369174i","1+995.070583247648i","1+0.133018476059154i","0.00272039573735412-0.0202951982647482i","0.109493256290175-0.583417112829399i","-0.0115427009882388-0.00380931277190253i",-38.30487766434657,-161.73611879744487]
[47.527233225121265,911162.75611549104,-7.7341962453571362,99.696325167158889,-39.793036979764125,-166.30390123010352,-47.527233225121265,-66.607576062944631,"-116.448235710315i","-3716.43305458452i","616.456252686734-3607.81088698661i",56874.999999999993,"-0.0691352806751478+0.404614305082611i","1+1092.08873669275i","1+0.14598761326269i","0.00271693290236989-0.0184922319576549i","0.0509724263253817-0.545549119316851i","-0.0099499321965045-0.0024248142831843i",-39.793036979764125,-166.30390123010352]
[49.872991413799561,1000000,-8.520035938857168,98.850559495577045,-41.352955474942391,-170.84956102003761,-49.872991413799561,-71.999001524460567,"-106.103295394597i","-3386.27538493395i","514.422914426342-3303.68442727228i",56874.999999999993,"-0.0576922894683749+0.370506664740817i","1+1198.56604032916i","1+0.160221225333079i","0.00271405799502818-0.0168494354358862i","-0.501423469424107i","-0.00844870237409955-0.00136089237608527i",-41.352955474942391,-170.84956102003761]
[]
[{"$f":"ABS(G135)","v":0.24517437166234579},{"$f":"fc*1000","v":40000},{"$f":"20*LOG(IMABS(M135))","v":7.2785910631243116},{"$f":"IF(180/PI()*IMARGUMENT(M135)>0,180/PI()*IMARGUMENT(M135),360+180/PI()*IMARGUMENT(M135))","v":159.27752145635174},{"$f":"S135","v":-7.5237654347866574},{"$f":"T135","v":-93.006157914051116},{"$f":"C135+E135","v":-0.24517437166234579},{"$f":"D135+F135","v":66.27136354230062},"-2652.58238486492i","-84656.8846233487i",{"$f":"IMDIV(IMPRODUCT(IMDIV(IMPRODUCT(J135,IMSUM(Rz*10^3,I135)),IMSUM(J135,IMSUM(Rz*10^3,I135))),Ro_EA*10^3),IMSUM(IMDIV(IMPRODUCT(J135,IMSUM(Rz*10^3,I135)),IMSUM(J135,IMSUM(Rz*10^3,I135))),Ro_EA*10^3))","v":"19279.0429892576-7293.58817942426i"},{"$f":"IF($E$1=\"Feedforward RC\",IMDIV(IMPRODUCT(IMSUM(Rz_2*10^3,IMDIV(1,COMPLEX(0,2*PI()*$B135*Cz_2*10^-12))),RFB_1*10^3),IMSUM(IMSUM(Rz_2*10^3,IMDIV(1,COMPLEX(0,2*PI()*$B135*Cz_2*10^-12))),RFB_1*10^3)),RFB_1*10^3)","v":56874.999999999993},{"$f":"IMPRODUCT(-gm_EA1*10^-6,K135,IMDIV(RFB_2*10^3,IMSUM(L135,RFB_2*10^3)))","v":"-2.16213566234665+0.817972506103656i"},{"$f":"COMPLEX(1,2*PI()*B135*1/(1/(Vreg/Iout_PreReg*Number_Cout*Co*10^-6)+(m_c*(1-Vreg/Vin_nom)-0.5)/(fsw*10^3*L_buck*10^-6*Number_Cout*Co*10^-6)))","v":"1+47.9426416131665i"},{"$f":"COMPLEX(1,2*PI()*B135*(ESR*10^-3*Co*10^-6))","v":"1+0.00640884901332318i"},{"$f":"IMPRODUCT(K,IMDIV(O135,N135))","v":"0.0114824320629586-0.421052992886405i"},{"$f":"IMDIV(1,IMSUM(COMPLEX(1,2*PI()*B135/(wn*Qp)),IMPRODUCT(COMPLEX(0,2*PI()*B135/wn),COMPLEX(0,2*PI()*B135/wn))))","v":"0.995248769487349-0.0795211058296368i"},{"$f":"IMPRODUCT(P135,Q135)","v":"-0.0220547232258235-0.41996556875442i"},{"$f":"20*LOG(IMABS(R135))","v":-7.5237654347866574},{"$f":"180/PI()*IMARGUMENT(R135)","v":-93.006157914051116}]
[null,null,{"$f":"20*LOG(IMABS((-gm_EA1*10^-6*Rz*10^3)))","v":24.389070741536219}]

{"sheet":"Control Loop2","index":2,"n_rows":141,"n_cols":28,"rows_kept":141,"cut":false,"hidden":false,"merged":[[30,21,30,27],[31,16,31,17],[0,1,0,2],[0,4,0,5],[31,2,31,3],[31,4,31,5],[31,6,31,7],[31,14,31,15]]}
[null,"Series RC with Parallel C",null,null,"No feedforward C"]
[null,"Rz",{"$f":"Rz_adj","v":10},"kΩ","Cz2",39,"pF"]
[null,"Cz",{"$f":"Cz_adj","v":1.5},"nF","Rz2",0,"kΩ"]
[null,"Cp",{"$f":"Cp_adj","v":27},"pF"]
[null,null,null,null,"AVOL2",60,"dB"]
[null,"Ro_EA",1300,"kΩ",null,{"$f":"10^(F5/20)","v":1000},"V/V"]
[null,"Cstray",25,"pF","gm_EA2",750,"uA/V"]
[]
[null,"Cp +Cstray",{"$f":"IF(Type=RCC,C4+Cstray_adj,IF(Type=RCRC,C4+Cstray_adj,Cstray_adj))","v":52},"pF"]
[null,null,null,null,"FB gain",{"$f":"RFB2_adj/(RFB1_adj+RFB2_adj)","v":0.24242424242424243}]
[null,null,null,null,"VFB",0.8,"V"]
[null,"Series RC"]
[null,"Series RC with Parallel C",null,null,"Ri",{"$f":"1/gm_POWER2","v":0.4}]
[null,null,null,null,"gmPOWER2",2.5,"A/V"]
[null,null,null,null,"K",{"$f":"Vout_sync_buck/(Iout_sync_buck*Ri_adj*(1+Vout_sync_buck*(mc_adj*(1-Vout_sync_buck/Vreg)-0.5)/(Iout_sync_buck*fsw*10^3*L_buck2*10^-6)))","v":9.7123748403041574}]
[null,null,null,null,"mc",{"$f":"(1+Se_adj/Sn_adj)","v":2.4157317073170734}]
[null,"No feedforward C",null,null,"Se (Slope Comp)",{"$f":"0.0003*fsw+0.0175","v":0.61749999999999994},"A/us"]
[null,"Feedforward RC",null,null,"Sn (Inductor)",{"$f":"(Vreg-Vout_sync_buck)/L_buck2","v":0.43617021276595741},"A/us"]
[null,null,null,null,"wn",{"$f":"PI()*fsw*10^3","v":6283185.307179586}]
[null,"Calculated",null,null,"Qp",{"$f":"1/(PI()*(mc_adj*(1-Vout_sync_buck/Vreg)-0.5))","v":0.7478133235627531}]
["fco",{"$f":"VLOOKUP(MIN(A34:A133),A34:H133,2,FALSE)/1000","v":42.292428743894995}]
["PM",{"$f":"VLOOKUP(MIN(A34:A133),A34:H133,8,FALSE)","v":68.875938047846844}]
[null,null,null,null,"wp",{"$f":"(1/(Vout_sync_buck/Iout_sync_buck*Number_Cout2*Co_2*10^-6)+(mc_adj*(1-Vout_sync_buck/Vreg)-0.5)/(fsw*10^3*L_buck2*10^-6*Number_Cout2*Co_2*10^-6))/(1000)","v":15.141386730581171},"Rad"]
[null,null,null,null,"wz",{"$f":"1/(ESR_2*10^-3*Co_2*10^-6*1000)","v":39215.686274509804},"Rad"]
[]
[]
[]
[]
[]
[]
[null,null,null,null,null,null,null,null,null,null,null,null,null,null,null,null,null,null,null,null,null,"SIMPLIS Data"]
[null,null,"Error Amplifier",null,"Control to Output",null,"Total System",null,"Error Amp",null,null,null,null,null,null,null,null,null,null,null,null,"freq       ","Comp_Gain  ","Comp_Phase ","Plant_Gain ","Plant_Phase "]
["Calculated","Frequency","Gain","Phase","Gain","Phase","Gain","Phase","ZCz","ZCp","ZT(s)","RFB1 with or without feedforward C","Tv(s)","1 + s/ωP","1 + s/ωZ","fp(s)","fh(s)","fp(s)fh(s)","Gain","Phase",null,100,32.573043300000002,115.0905728,23.39172044,-5.4185991199999997,{"$f":"W33+Y33","v":55.964763740000002},{"$f":"X33+Z33","v":109.67197368000001}]
[{"$f":"ABS(G34)","v":63.011089070292655},100,{"$f":"20*LOG(IMABS(M34))","v":43.272052393133393},{"$f":"IF(180/PI()*IMARGUMENT(M34)>0,180/PI()*IMARGUMENT(M34),360+180/PI()*IMARGUMENT(M34))","v":128.59020595126353},{"$f":"S34","v":19.739036677159259},{"$f":"T34","v":-2.382969823442993},{"$f":"C34+E34","v":63.011089070292655},{"$f":"D34+F34","v":126.20723612782054},{"$f":"IMDIV(1,COMPLEX(0,2*PI()*$B34*Cz_adj*10^-9))","v":"-1061032.95394597i"},{"$f":"IMDIV(1,COMPLEX(0,2*PI()*$B34*Cp_Cstray_adj*10^-12))","v":"-30606719.8253645i"},{"$f":"IMDIV(IMPRODUCT(IMDIV(IMPRODUCT(J34,IMSUM(Rz_adj*10^3,I34)),IMSUM(J34,IMSUM(Rz_adj*10^3,I34))),Ro_adj*10^3),IMSUM(IMDIV(IMPRODUCT(J34,IMSUM(Rz_adj*10^3,I34)),IMSUM(J34,IMSUM(Rz_adj*10^3,I34))),Ro_adj*10^3))","v":"500003.540715018-626563.253597912i"},{"$f":"IF($E$1=\"Feedforward RC\",IMDIV(IMPRODUCT(IMSUM(Rz_2_adj*10^3,IMDIV(1,COMPLEX(0,2*PI()*$B34*Cz_2_adj*10^-12))),RFB1_adj*10^3),IMSUM(IMSUM(Rz_2_adj*10^3,IMDIV(1,COMPLEX(0,2*PI()*$B34*Cz_2_adj*10^-12))),RFB1_adj*10^3)),RFB1_adj*10^3)","v":4750},{"$f":"IMPRODUCT(-gm_EA2*10^-6,K34,IMDIV(RFB2_adj*10^3,IMSUM(L34,RFB2_adj*10^3)))","v":"-90.9097346754577+113.920591563257i"},{"$f":"COMPLEX(1,2*PI()*B34*1/(1/(Vout_sync_buck/Iout_sync_buck*Number_Cout2*Co_2*10^-6)+(mc_adj*(1-Vout_sync_buck/Vreg)-0.5)/(fsw*10^3*L_buck2*10^-6*Number_Cout2*Co_2*10^-6)))","v":"1+0.0414967626082054i"},{"$f":"COMPLEX(1,2*PI()*B34*(ESR_2*10^-3*Co_2*10^-6))","v":"1+0.0000160221225333079i"},{"$f":"IMPRODUCT(K_adj,IMDIV(O34,N34))","v":"9.69568550853018-0.402183947011514i"},{"$f":"IMDIV(1,IMSUM(COMPLEX(1,2*PI()*B34/(wn_adj*Qp_adj)),IMPRODUCT(COMPLEX(0,2*PI()*B34/wn_adj),COMPLEX(0,2*PI()*B34/wn_adj))))","v":"0.999999992118102-0.000133723212813844i"},{"$f":"IMPRODUCT(P34,Q34)","v":"9.69563165078024-0.403480482058174i"},{"$f":"20*LOG(IMABS(R34))","v":19.739036677159259},{"$f":"180/PI()*IMARGUMENT(R34)","v":-2.382969823442993},null,109.64781960000001,31.898697810000002,113.24880450000001,23.383973229999999,-5.9378574500000001,{"$f":"W34+Y34","v":55.282671039999997},{"$f":"X34+Z34","v":107.31094705000001}]
[{"$f":"ABS(G35)","v":62.491356091223608},109.74987654930599,{"$f":"20*LOG(IMABS(M35))","v":42.753845888181004},{"$f":"IF(180/PI()*IMARGUMENT(M35)>0,180/PI()*IMARGUMENT(M35),360+180/PI()*IMARGUMENT(M35))","v":126.08556253690257},{"$f":"S35","v":19.7375102030426},-2.6150008343349946,{"$f":"C35+E35","v":62.491356091223608},123.47056170256758,"-966773.710646764i","-27887703.1917336i","444800.150788909-610296.229585574i",4750,"-80.8727546888924+110.962950833741i","1+0.045542645734464i","1+0.000017584259700884i","9.69227954551671-0.441241268779355i","0.999999990506226-0.000146761061044531i",{"$f":"IMPRODUCT(P35,Q35)","v":"9.69221469646362-0.44266371382035i"},{"$f":"20*LOG(IMABS(R35))","v":19.7375102030426},{"$f":"180/PI()*IMARGUMENT(R35)","v":-2.6150008343349946},null,120.2264435,31.206110370000001,111.5357657,23.37467728,-6.5061040700000001,54.580787650000005,105.02966162999999]
[61.93774551623585,120.450354025878,42.202073244619655,123.66188255525508,19.735672271616199,-2.8695563832473261,61.93774551623585,120.79232617200775,"-880888.198732913i","-25410236.5019108i","392829.453516844-589872.676929883i",4750,"-71.4235370030624+107.249577623615i","1+0.0499829974708616i","1+0.0000192987033138294i","9.68818022791545-0.484056851588633i","0.999999988564716-0.00016107008340286i","9.6881021500509-0.485617322050638i",19.735672271616199,-2.8695563832473261,null,131.8256739,30.497589049999998,109.95111660000001,23.36352737,-7.12771869,53.861116420000002,102.82339791000001]
[61.352399395191576,132.19411484660299,41.618939886304872,121.3353226286419,19.733459508886703,-3.1488010814325538,61.352399395191576,118.18652154720935,"-802632.518987084i","-23152861.1246274i","344628.558492577-566028.01141371i",4750,"-62.6597379077412+102.914183893402i","1+0.0548562780199133i","1+0.0000211803030625446i","9.68324718858416-0.530981188869942i","0.99999998622616-0.000176774217803595i","9.68315319142433-0.532692930003853i",19.733459508886703,-3.1488010814325538,null,144.54397710000001,29.775256200000001,108.492949,23.350160020000001,-7.8073968799999998,53.125416220000005,100.68555212]
[60.737723008259508,145.08287784959401,41.006927283940009,119.11893269649646,19.730795724319496,-3.4551005102805985,60.737723008259508,115.66383218621586,"-731328.85814819i","-21096024.7542747i","300540.254976819-539544.639353566i",4750,"-54.6436827230579+98.0990253370118i","1+0.0602046974063987i","1+0.0000232453564639114i","9.67731199342953-0.582393872656464i","0.99999998340936-0.000194009485957302i","9.67719884294087-0.584271353319471i",19.730795724319496,-3.4551005102805985,null,158.48931920000001,29.041032900000001,107.15817010000001,23.334143210000001,-8.5501486599999996,52.375176109999998,98.608021440000002]
[60.09626297760213,159.228279334109,40.368673623513196,117.0225786801585,19.727589354088934,-3.7910376100637984,60.09626297760213,113.23154107009471,"-666359.6180171i","-19221912.0581855i","260722.708962164-511199.017342665i",4750,"-47.4041289022116+92.9452758804844i","1+0.0660745810804054i","1+0.0000255117500225888i","9.67017268625823-0.63870482954064i","0.999999980016516-0.000212925171526218i","9.6700364966791-0.640763839955002i",19.727589354088934,-3.7910376100637984,null,173.7800829,28.296635569999999,105.9428513,23.314964629999999,-9.3612878899999998,51.611600199999998,96.581563410000001]
[59.430595507074152,174.752840000768,39.706865096995216,115.05306404269388,19.723730410078936,-4.1594296571670055,59.430595507074152,110.89363438552687,"-607162.066116524i","-17514290.3687459i","225172.693366654-481719.105734057i",4750,"-40.9404897030279+87.5852919516466i","1+0.0725167711662158i","1+0.0000279991141553586i","9.66158734393529-0.700355180630689i","0.999999975929822-0.000233685113149059i","9.66142344879953-0.702612932904682i",19.723730410078936,-4.1594296571670055,null,190.54607179999999,27.543581490000001,104.8425302,23.292018460000001,-10.246409399999999,50.835599950000002,94.596120799999994]
[58.743231375692304,191.79102616724899,39.024144529502266,113.21440151599273,19.719086846190041,-4.5633455754176291,58.743231375692304,108.65105594057511,"-553223.461571507i","-15958369.0837935i","193756.689903019-451754.593633638i",4750,"-35.2284890732761+82.1371988424795i","1+0.0795870668324645i","1+0.0000307289932204053i","9.65126649443227-0.767817540009685i","0.999999971007386-0.000256469123534456i","9.65106929312531-0.770292769607472i",19.719086846190041,-4.5633455754176291,null,208.92961310000001,26.783200560000001,103.8524656,23.264590640000002,-11.2113502,50.047791200000006,92.641115400000004]
[58.036540826060339,210.49041445120201,38.323040585142429,111.5081816774245,19.713500240917909,-5.0061232096077593,58.036540826060339,106.50205846781674,"-504076.613993246i","-14540671.5574975i","166244.603047826-421859.843240376i",4750,"-30.226291463241+76.7017896800682i","1+0.087346707597843i","1+0.0000337250321242393i","9.63886424368097-0.841595506514613i","0.999999965078294-0.000281474546914632i","9.63862701936151-0.844308572070424i",19.713500240917909,-5.0061232096077593,null,229.0867653,26.01665083,102.96784390000001,23.231842820000001,-12.2621296,49.24849365,90.705714300000011]
[57.312698527425937,231.01297000831599,37.605917845088221,109.93398903492678,19.706780682337715,-5.4913860348439503,57.312698527425937,104.44260300008283,"-459295.83689945i","-13248918.3720995i","142342.006883378-392487.821879762i",4750,"-25.8803648878869+71.3614221599566i","1+0.0958629037585157i","1+0.0000370131811225663i","9.62396795875966-0.922222028316522i","0.99999995793668-0.00030891796834939i","9.62368266298826-0.925195006154081i",19.706780682337715,-5.4913860348439503,null,251.1886432,25.244936030000002,102.1839449,23.192795400000001,-13.404864099999999,48.437731429999999,88.779080800000003]
[56.57364668066041,253.53644939701101,36.874945951205831,108.48982545267754,19.698700729454579,-6.0230585746183607,56.57364668066041,102.46676687805918,"-418493.260621673i","-12071920.9794713i","121718.298246053-363992.443566405i",4750,"-22.1305996811005+66.1804442848008i","1+0.105209418531551i","1+0.0000406219205889874i","9.6060863701933-1.01025622605241i","0.999999949334581-0.00033903708968581i","9.60574336916619-1.01351299443358i",19.698700729454579,-6.0230585746183607,null,275.4228703,24.468923759999999,101.4962694,23.14631013,-14.6456497,47.615233889999999,86.85061970000001]
[55.821073114133419,278.255940220713,36.132084800333743,107.17251192093498,19.688988313799676,-6.6053795426856716,55.821073114133419,100.56713237824931,"-381315.4727638i","-10999484.7912635i","104029.477029421-336636.584963183i",4750,"-18.9144503689856+61.2066518114877i","1+0.115467206956619i","1+0.0000445825076983707i","9.58463599269766-1.10627814574659i","0.999999938973322-0.000372092788422584i","9.58422376965914-1.10984445216665i",19.688988313799676,-6.6053795426856716,null,301.99517200000003,23.689363539999999,100.90063619999999,23.091073309999999,-15.9904077,46.780436850000001,84.910228499999988]
[55.056400759276926,305.38555088334198,35.379082319920087,105.97805047403304,19.677318439356839,-7.2429113971108512,55.056400759276926,98.735139076922195,"-347440.457112945i","-10022320.878258i","88935.3142222023-310603.335460755i",4750,"-16.1700571313095+56.4733337201372i","1+0.126725117089821i","1+0.0000489292471615465i","9.55892583216537-1.21088077614498i","0.99999992649315-0.000408371377312248i","9.55843064046853-1.21478427884466i",19.677318439356839,-7.2429113971108512,null,331.13112150000001,22.906904010000002,100.39325479999999,23.025580850000001,-17.4446862,45.932484860000002,82.948568599999987]
[54.280784980122178,335.16026509388399,34.617481439504218,104.90193711567018,19.663303540617964,-7.9405445871997449,54.280784980122178,96.961392528470441,"-316574.804489057i","-9131965.51410742i","76111.3470358094-286008.556226704i",4750,"-13.8384267337835+52.0015556775824i","1+0.139080659563041i","1+0.0000536997883563018i","9.52814046141182-1.32465850730909i","0.999999911460736-0.000448187084273411i","9.52754592296323-1.32892877951675i",19.663303540617964,-7.9405445871997449,null,363.07805480000002,22.12210906,99.97077736,22.948127039999999,-19.0134145,45.070236100000002,80.957362860000003]
[53.495115650289932,367.83797718286303,33.848633277904526,103.93942339306693,19.646482372385403,-8.7034942749873192,53.495115650289932,95.235929118079611,"-288451.171374971i","-8320706.86658574i","65256.4989604679-262913.384709279i",4750,"-11.8648179928123+47.8024335835052i","1+0.152640852174398i","1+0.0000589354514282796i","9.49132172684678-1.44819103345161i","0.999999893354139-0.000491884774093404i","9.49060837151727-1.45285951565149i",19.646482372385403,-8.7034942749873192,null,398.10717060000002,21.33547287,99.630335840000001,22.856799479999999,-20.700608599999999,44.192272349999996,78.929727240000005]
[52.700021454257275,403.70172585965503,33.073714117052013,103.08572881714565,19.626307337205262,-9.5372867165748314,52.700021454257275,93.548442100570824,"-262825.96431476i","-7581518.20138733i","56097.2423797616-241335.824690301i",4750,"-10.1994986145021+43.8792408527819i","1+0.167523146825209i","1+0.0000646815851863128i","9.44734961608363-1.58202152504367i","0.999999871544677-0.000539842935496277i","9.44649435937718-1.58712140677399i",19.626307337205262,-9.5372867165748314,null,436.51583219999998,20.54743363,99.369567849999996,22.74948281,-22.509030500000001,43.296916440000004,76.860537349999987]
[51.895874523633211,443.062145758388,32.293744308154132,102.33620900649562,19.602130215479082,-10.447731798341303,51.895874523633211,91.888477208154313,"-239477.230023748i","-6907997.01991583i","48389.1883325922-221260.96089356i",4750,"-8.79803424228948+40.2292656170108i","1+0.183856446832179i","1+0.0000709879598921124i","9.39492319974465-1.72662773609064i","0.999999845275102-0.000592476959449849i","9.39389875896494-1.73219374446999i",19.602130215479082,-10.447731798341303,null,478.6300923,19.758386380000001,99.186633670000006,22.623874749999999,-24.439810600000001,42.382261130000003,74.746823070000005]
[51.082794142155763,486.26015800653499,31.509607781988311,101.68648569603093,19.573186360167448,-11.440877459062678,51.082794142155763,90.245608236968252,"-218202.732935341i","-6294309.60390409i","41916.8732749311-202649.623518786i",4750,"-7.6212496863511+36.8453860943247i","1+0.201782223426256i","1+0.0000779091983464639i","9.33254308811229-1.88238461120278i","0.999999813633301-0.000650242737108354i","9.33131734191516-1.88845267875077i",19.573186360167448,-11.440877459062678,null,524.80746020000004,18.968694769999999,99.080227350000001,22.477517370000001,-26.492051700000001,41.44621214,72.588175649999997]
[50.260648844113263,533.66992312063098,30.722071278458735,101.13254503754116,19.538577565654531,-12.522940938734882,50.260648844113263,88.609604098806287,"-198818.203533298i","-5735140.48653742i","36492.3667310818-185445.515136398i",4750,"-6.63497576928759+33.7173663884359i","1+0.221455741108761i","1+0.0000855052490057978i","9.25849753965326-2.04951697516839i","0.999999775520636-0.000713640608556342i","9.25703284277022-2.05612375491264i",19.538577565654531,-12.522940938734882,null,575.4399373,18.178702309999998,99.049583389999995,22.30784658,-28.6624427,40.486548889999995,70.387140689999995]
[49.42905679578179,585.70208180566704,29.93180276233673,100.67081029372312,19.49725403344506,-13.700211067290834,49.42905679578179,86.970599226432284,"-181155.74229733i","-5225646.41242297i","31953.1777847376-169580.92165799i",4750,"-5.8096686881341+30.8328948469072i","1+0.243047402478215i","1+0.0000938419052270395i","9.17085523456584-2.22804111550568i","0.999999729613788-0.000783219696558489i","9.16910770920663-2.23522330752808i",19.49725403344506,-13.700211067290834,null,630.95734449999998,17.388743059999999,99.094480200000007,22.112261220000001,-30.9449194,39.501004280000004,68.149560800000003]
[48.587384908567586,642.80731172843196,29.139388758239022,100.29819436216995,19.447996150328567,-14.978915288900335,48.587384908567586,85.319279073269612,"-165062.365437782i","-4761414.38762834i","28159.8089193393-154981.1826683i",4750,"-5.11996525806168+28.1783968487818i","1+0.266744224176134i","1+0.000102991375138192i","9.0674687621039-2.41769462934807i","0.999999674318816-0.000859582662855626i","9.06538760061247-2.42548808089431i",19.447996150328567,-14.978915288900335,null,691.83097090000001,16.599152109999999,99.21524101,21.888211439999999,-33.330420699999998,38.487363549999998,65.884820310000009]
[47.734747709263161,705.48023107186498,28.345350531215768,100.01213674755756,19.389397178047396,-16.365045034174152,47.734747709263161,83.647091713383418,"-150398.679823232i","-4338423.45643937i","24993.1993090085-141568.113167747i",4750,"-4.54421805618336+25.7396569395903i","1+0.292751456735711i","1+0.000113032907070598i","8.94599398892633-2.61785495424433i","0.999999607715811-0.000943390928208214i","8.94352081893913-2.62629349687418i",19.389397178047396,-16.365045034174152,null,758.57757500000002,15.81027613,99.412732410000004,21.633303080000001,-35.8067882,37.443579210000003,63.605944210000004]
[46.870007602710459,774.26368268112697,27.550159174628863,99.810628745192616,19.319848428081599,-17.8641337173575,46.870007602710459,81.946495027835113,"-137037.675623867i","-3953009.8737654i","22352.2168945861-129262.563250091i",4750,"-4.06403943537928+23.5022842272892i","1+0.321294362363736i","1+0.000124053475970073i","8.80393151080809-2.82744870720022i","0.999999527492235-0.00103537040140673i","8.80099989417916-2.83656270131105i",19.319848428081599,-17.8641337173575,null,831.76377109999999,15.02248413,99.688360270000004,21.345411540000001,-38.358855599999998,36.367895670000003,61.329504670000006]
[45.991778801114563,849.75343590864497,26.754249758335263,99.692229771376347,19.2375290427793,-19.480983451156593,45.991778801114563,80.211246320219757,"-124863.626213103i","-3601835.37153181i","20151.2970159772-117986.284722214i",4750,"-3.66387218472312+21.4520517676752i","1+0.352620166054079i","1+0.000136148536732277i","8.63869704896605-3.04485646227459i","0.999999430862621-0.00113631776687877i","8.63523220786498-3.05467103427239i",19.2375290427793,-19.480983451156593,null,912.01083940000001,14.23617876,100.0440622,21.022795760000001,-40.9687567,35.258974520000002,59.075305499999999]
[45.098437825351525,932.60334688321996,25.958034749411361,99.656077003582169,19.14040307594016,-21.219339997678137,45.098437825351525,78.436737005904035,"-113771.085798905i","-3281858.24419919i","18318.2813675076-107663.25096884i",4750,"-3.3305966122741+19.5751365397891i","1+0.387000196932308i","1+0.00014942285098736i","8.44772748871769-3.26782095102571i","0.999999314471863-0.00124710738536354i","8.44364637392073-3.27835393418322i",19.14040307594016,-21.219339997678137,null,1000,13.45180837,100.48229550000001,20.664200600000001,-43.616458799999997,34.116008970000003,56.86583670000001]
[44.188144023874216,1023.53102189903,25.16191695401583,99.70188978031706,19.026227069858383,-23.081520943303495,44.188144023874216,76.620368837013558,"-103663.976102782i","-2990307.00296486i","16792.4808024466-98220.5526631215i",4750,"-3.05317832771756+17.8582823023857i","1+0.42473223837878i","1+0.000163991394495082i","8.22862768021655-3.49337070751004i","0.999999174278714-0.00136869886743767i","8.22383951313261-3.50463033634597i",19.026227069858383,-23.081520943303495,null,1096.478196,12.669879890000001,101.00601829999999,20.268935580000001,-46.280493900000003,32.938815470000002,54.725524399999991]
[43.25887386570669,1123.3240329780299,24.366302249078803,99.829969546008485,18.89257161662789,-25.068009850535024,43.25887386570669,74.761959695473465,"-94454.7541757011i","-2724656.37045292i","15522.965618136-89588.9695818601i",4750,"-2.82235738511563+16.2889035603382i","1+0.466143107285812i","1+0.000179980353009836i","7.97935947171436-3.71777538164308i","0.999999005415472-0.0015021453855089i","7.97376689643299-3.72975784201096i",18.89257161662789,-25.068009850535024,null,1202.264435,11.89097289,101.6186616,19.83692005,-48.938830299999999,31.72789294,52.679831299999996]
[42.30847265342932,1232.84673944207,23.571612380395372,100.04119549114571,18.736860273033948,-27.177039040281219,42.30847265342932,72.864156450864499,"-86063.6541429428i","-2482605.4079695i","14467.074567121-81703.2989535475i",4750,"-2.630377194022+14.8551452642813i","1+0.511591484789277i","1+0.0001975282152413i","7.6984681996877-3.9365523088133i","0.999998802018957-0.00164860279629615i","7.69196916592466-3.94923930909946i",18.736860273033948,-27.177039040281219,null,1318.2567389999999,11.115754819999999,102.32409010000001,19.3686884,-51.569803800000003,30.484443219999999,50.754286300000004]
[41.334726548415176,1353.04777457981,22.778298101129298,100.33701540889354,18.556428447285874,-29.40419483882533,41.334726548415176,70.932820570068202,"-78417.9963102543i","-2262057.58587271i","13589.1267314924-74502.5038532597i",4750,"-2.4707503148168+13.5459097915017i","1+0.56147102299299i","1+0.000216786972377373i","7.38533295644713-4.14454493386399i","0.999998557026928-0.00180933965284196i","7.37782341011872-4.1579015291648i",18.556428447285874,-29.40419483882533,null,1445.4397710000001,10.344997340000001,103.1265453,18.865354880000002,-54.153013199999997,29.210352220000004,48.973532100000007]
[40.335456208959762,1484.9682622544599,21.986852911103956,100.71943064242004,18.348603297855806,-31.742089795323743,40.335456208959762,68.977340847096286,"-71451.5576471059i","-2061102.62443574i","12859.3168816668-67929.7311340698i",4750,"-2.33805761484851+12.3508602061945i","1+0.616213754594927i","1+0.000237923434559143i","7.04041622442028-4.33609051398133i","0.999998261932864-0.00198574819281888i","7.03179360380218-4.35006347135924i",18.348603297855806,-31.742089795323743,null,1584.893192,9.5795937850000001,104.0305692,18.328542580000001,-56.670095600000003,27.908136365000001,47.360473599999999]
[39.308630834599654,1629.75083462064,21.197827629759761,101.19097331047035,18.110803204839893,-34.180153773218173,39.308630834599654,67.010819537252189,"-65103.9981944816i","-1877999.94791774i","12252.7737834714-61932.2370000207i",4750,"-2.22777705154025+11.2604067272765i","1+0.676293834947774i","1+0.000261120675710528i","6.66547798644053-4.50528556732877i","0.999997906490583-0.00217935639836039i","6.655645409272-4.51980258756889i",18.110803204839893,-34.180153773218173,null,1737.800829,8.8205772190000005,105.0409015,17.76028599,-59.105315099999999,26.580863209,45.935586400000005]
[38.252498133767901,1788.6495290574401,20.411845988954035,101.75467325660273,17.84065214481387,-36.704596559403896,38.252498133767901,65.050076697198833,"-59320.3384290213i","-1711163.60852946i","11748.7612402567-56461.2492341491i",4750,"-2.1361384073194+10.2656816789362i","1+0.74223164896575i","1+0.000286579619237019i","6.26371252682305-4.64634230874767i","0.999997478358468-0.00239184123194609i","6.2525834188736-4.66131239822464i",17.84065214481387,-36.704596559403896,null,1905.460718,8.0691386250000008,106.1623441,17.16291884,-61.445931799999997,25.232057465,44.716412300000002]
[37.165722140818531,1963.0406500402701,19.629621358019026,102.41401136554765,17.536100782799501,-39.298585604939255,37.165722140818531,63.115425760608396,{"$f":"IMDIV(1,COMPLEX(0,2*PI()*$B66*Cz_adj*10^-9))","v":"-54050.4830566909i"},{"$f":"IMDIV(1,COMPLEX(0,2*PI()*$B66*Cp_Cstray_adj*10^-12))","v":"-1559148.54971223i"},{"$f":"IMDIV(IMPRODUCT(IMDIV(IMPRODUCT(J66,IMSUM(Rz_adj*10^3,I66)),IMSUM(J66,IMSUM(Rz_adj*10^3,I66))),Ro_adj*10^3),IMSUM(IMDIV(IMPRODUCT(J66,IMSUM(Rz_adj*10^3,I66)),IMSUM(J66,IMSUM(Rz_adj*10^3,I66))),Ro_adj*10^3))","v":"11330.0028505415-51471.7879301812i"},{"$f":"IF($E$1=\"Feedforward RC\",IMDIV(IMPRODUCT(IMSUM(Rz_2_adj*10^3,IMDIV(1,COMPLEX(0,2*PI()*$B66*Cz_2_adj*10^-12))),RFB1_adj*10^3),IMSUM(IMSUM(Rz_2_adj*10^3,IMDIV(1,COMPLEX(0,2*PI()*$B66*Cz_2_adj*10^-12))),RFB1_adj*10^3)),RFB1_adj*10^3)","v":4750},{"$f":"IMPRODUCT(-gm_EA2*10^-6,K66,IMDIV(RFB2_adj*10^3,IMSUM(L66,RFB2_adj*10^3)))","v":"-2.06000051828027+9.35850689639657i"},{"$f":"COMPLEX(1,2*PI()*B66*1/(1/(Vout_sync_buck/Iout_sync_buck*Number_Cout2*Co_2*10^-6)+(mc_adj*(1-Vout_sync_buck/Vreg)-0.5)/(fsw*10^3*L_buck2*10^-6*Number_Cout2*Co_2*10^-6)))","v":"1+0.814598318449784i"},{"$f":"COMPLEX(1,2*PI()*B66*(ESR_2*10^-3*Co_2*10^-6))","v":"1+0.000314520778328097i"},{"$f":"IMPRODUCT(K_adj,IMDIV(O66,N66))","v":"5.83976675115499-4.75400943193562i"},{"$f":"IMDIV(1,IMSUM(COMPLEX(1,2*PI()*B66/(wn_adj*Qp_adj)),IMPRODUCT(COMPLEX(0,2*PI()*B66/wn_adj),COMPLEX(0,2*PI()*B66/wn_adj))))","v":"0.999996962670906-0.00262504316308094i"},"5.82726953390501-4.76932463222857i",17.536100782799501,-39.298585604939255,null,2089.2961310000001,7.3266441499999999,107.3995884,16.538959030000001,-63.682347100000001,23.865603180000001,43.717241299999998]
[36.047517656392941,2154.4346900318801,18.851974602097695,103.17285504276521,17.19554305429525,-41.942662196825296,36.047517656392941,61.230192845939911,"-49248.7871113079i","-1420638.08974927i","10982.1131147693-46922.4609915265i",4750,"-1.99674783904896+8.53135654391389i","1+0.894020648871356i","1+0.000345186165937001i","5.39961003274118-4.8240102876903i","0.999996341522085-0.00288098211171974i","5.38569239104154-4.83954881906979i",17.19554305429525,-41.942662196825296,null,2290.8676529999998,6.5946500370000001,108.7569986,15.891001040000001,-65.808050699999995,22.485651077,42.948947900000007]
[34.897768277300806,2364.4894126454101,18.079852912725205,104.03537080435675,16.817915364575601,-44.615389185835106,34.897768277300806,59.419981618521639,"-44873.6605996842i","-1294432.51729858i","10693.119367395-42775.246348785i",4750,"-1.94420352134454+7.77731751796089i","1+0.981186558461617i","1+0.000378841390981141i","4.95024766937511-4.85343702465258i","0.999995593344205-0.00316187494670006i","4.9348798944039-4.86906770131195i",16.817915364575601,-44.615389185835106,null,2511.8864319999998,5.87491333,110.238348,15.22162284,-67.819411500000001,21.09653617,42.418936500000001]
[33.717115284750307,2595.0242113997401,17.314349222238338,105.00590816158811,16.402766062511965,-47.294188344879132,33.717115284750307,57.711719816708978,"-40887.2082689993i","-1179438.70006729i","10453.0608724645-38995.2695452247i",4750,"-1.90055652226627+7.09004900822266i","1+1.07685103663001i","1+0.000415777958919475i","4.4992992585156-4.8410368792538i","0.999994692158511-0.00347015469097045i","4.48247623011262-4.85662444822542i",16.402766062511965,-47.294188344879132,null,2754.2287030000002,5.1693958950000001,111.8465063,14.533311579999999,-69.715361700000003,19.702707475,42.131144599999999]
[32.507007360557054,2848.0358684357998,16.556721506583369,106.0888484557543,15.950285853973686,-49.956293288368975,32.507007360557054,56.132555167385327,"-37254.9013762495i","-1074660.61662258i","10253.6532002775-35550.5828319248i",4750,"-1.86430058186863+6.46374233307723i","1+1.18184268332135i","1+0.000456315796633345i","4.05449213824469-4.78733995810596i","0.999993606673099-0.00380849160025585i","4.03623367253302-4.80275085032843i",15.950285853973686,-49.956293288368975,null,3019.95172,4.4802588419999996,113.58308340000001,13.82840901,-71.497022200000004,18.308667851999999,42.086061200000003]
[31.269705783797221,3125.7158496882398,15.808410884210303,107.28841223183592,15.461294899586917,-52.579722969075732,31.269705783797221,54.708689262760188,"-33945.2786167941i","-979190.729330606i","10088.0076436784-32411.9500243965i",4750,"-1.83418320794152+5.89308182261754i","1+1.29707088595218i","1+0.000500806023480077i","3.62313957606286-4.69460484402993i","0.999992299196202-0.00417981629812422i","3.60348908913552-4.70971274964952i",15.461294899586917,-52.579722969075732,null,3311.3112150000002,3.8098441030000001,115.44803949999999,13.10907551,-73.167309399999994,16.918919613,42.2807301]
[30.008245346753654,3430.4692863149198,15.071056932122499,108.60841945133883,14.937188414631155,-55.144176963126881,30.008245346753654,53.464242488211951,"-30929.6736215864i","-892202.123699605i","9950.39690914619-29552.6399599518i",4750,"-1.80916307439021+5.37320726544577i","1+1.4235336960895i","1+0.000549633992520871i","3.21167699902963-4.56659217771394i","0.999990724327124-0.00458734516835516i","3.19069867400212-4.58128289046256i",14.937188414631155,-55.144176963126881,null,3630.7805480000002,3.1606400149999998,117.4392813,12.37727026,-74.730555899999999,15.537910275,42.708725400000006]
[28.72635631749673,3764.93580679247,14.346508083469891,110.05199874211519,14.379848234026841,-57.63176816005894,28.72635631749673,52.420230582056249,"-28181.9666627972i","-812941.34604223i","9836.05962334159-26948.230348736i",4750,"-1.7883744769712+4.89967824522472i","1+1.562326474096i","1+0.000603222628264676i","2.82531598092839-4.40820723041308i","0.999988827379375-0.00503460822522991i","2.80309081836403-4.42238233826251i",14.379848234026841,-57.63176816005894,null,3981.0717060000002,2.5352283149999999,119.5522754,11.634744420000001,-76.192163800000003,14.169972735,43.360111599999996]
[27.428356146069238,4132.0124001153399,13.636824395522599,111.6212454255061,13.791531750546639,-60.027536969686452,27.428356146069238,51.593708455819652,"-25678.3584172292i","-740721.877420069i","9741.03733481356-24576.4230442434i",4750,"-1.77109769723883+4.46844055349879i","1+1.71465137661747i","1+0.000662036089837958i","2.46784962827421-4.22507181974296i","0.999986542481149-0.00552547970404281i","2.4444708685532-4.23865101379296i",13.791531750546639,-60.027536969686452,null,4365.1583220000002,1.936211334,121.77971770000001,10.88304391,-77.558302999999995,12.819255243999999,44.221414700000011]
[26.11902065483385,4534.8785081285796,12.944269477907209,113.31683367465226,13.174751176926641,-62.319726058523223,26.11902065483385,50.997107616129036,"-23397.1638279639i","-674918.187345115i","9662.03867443421-22416.8712037712i",4750,"-1.75673430444258+4.07579476432203i","1+1.88182776908864i","1+0.000726583791309008i","2.14161287585189-4.02308972628178i","0.999983790287109-0.00606421163798682i","2.11718129338327-4.03601170687819i",13.174751176926641,-62.319726058523223,null,4786.3009229999998,1.366120317,124.1113076,10.123519010000001,-78.835659500000006,11.489639327000001,45.275648099999998]
[24.803443348005132,4977.0235643321103,12.271288097321483,115.13759607416939,12.532155250683651,-64.499827591441743,24.803443348005132,50.637768482727651,"-21318.6242787732i","-614960.315733843i","9596.32618124698-20451.0184135203i",4750,"-1.74478657840854+3.71836698427641i","1+2.06530365344534i","1+0.000797424813988901i","1.84757551078301-3.80805956373586i","0.999980475221871-0.00665547071381422i","1.82219500837818-3.82028169692135i",12.532155250683651,-64.499827591441743,null,5248.0746019999997,0.82730871100000003,126.53367609999999,9.3573381070000003,-80.031232099999997,10.184646818000001,46.502443999999997]
[23.486889043959362,5462.27721768434,11.620466125516163,117.08009387165903,11.866422918443199,-66.562439669027668,23.486889043959362,50.517654202631363,"-19424.7364544376i","-560328.936185701i","9541.62201838162-18661.9495768888i",4750,"-1.73484036697847+3.3930817412525i","1+2.26666821002456i","1+0.000875172748926349i","1.58552994133959-3.58537030828897i","0.999976482159249-0.00730437872757893i","1.55930375048856-3.59686729929649i",11.866422918443199,-66.562439669027668,null,5754.3993730000002,0.321837496,129.03051020000001,8.5855037430000003,-81.152174000000002,8.9073412390000009,47.878336200000007]
[22.174645403294349,5994.8425031894103,10.994470295584568,119.13821242386778,11.180175107709779,-68.504982248167906,22.174645403294349,50.633230175699879,"-17699.0964046424i","-510550.857826222i","9496.02941194321-17034.2531773795i",4750,"-1.72655080217149+3.09713694134172i","1+2.48766556228431i","1+0.000960501011539833i","1.35433105581941-3.35979398163552i","0.999971672421674-0.0080165569936178i","1.32735871095975-3.37055587890555i",11.180175107709779,-68.504982248167906,null,6309.573445,-0.14863741,131.58290020000001,7.8088693920000001,-82.205674900000005,7.660231982,49.377225300000006]
[20.871874139463532,6579.3322465756801,10.395966866887477,121.30282688711425,10.475907272576055,-70.327325766181417,20.871874139463532,50.975501120932833,"-16126.7574608077i","-465194.926754068i","9457.96715886-15553.8944061414i",4750,"-1.71963039252+2.82798080111661i","1+2.73020988356662i","1+0.0010541486744198i","1.15214981125533-3.13537251497535i","0.999965878960379-0.00879817509505088i","1.12452494233101-3.14540234858069i",10.475907272576055,-70.327325766181417,null,6918.3097090000001,-0.58296382000000002,134.1699093,7.028155988,-83.198876999999996,6.4451921680000002,50.971032300000005]
[19.583463413466841,7220.8090183854702,9.8275208342022182,123.56159025957194,9.755942579264623,-72.031380592450702,19.583463413466841,51.530209667121241,"-14694.1007751955i","-423868.291592179i","9426.11498085537-14208.0985708318i",4750,"-1.71383908742825+2.58329064924214i","1+2.99640197675131i","1+0.00115692686882187i","0.976711667676722-2.91538426432978i","0.999958900548377-0.00965600440285043i","0.948520562070417-2.92469557579865i",9.755942579264623,-72.031380592450702,null,7585.7757499999998,-0.98056619,136.76933270000001,6.2439674729999997,-84.138818799999996,5.2634012829999994,52.630513900000011]
[18.313884230495745,7924.8289835391797,9.2914805806850662,125.89889605318143,9.0224036498106788,-73.620685716815416,18.313884230495745,52.278210336366016,"-13388.7173609659i","-386213.000797094i","9399.36786283053-12985.2441638851i",4750,"-1.70897597506009+2.36095348434274i","1+3.28854747040551i","1+0.00126972581029775i","0.825501940497976-2.70237026522544i","0.999950494783604-0.0105974768333685i","0.796822767564866-2.71098472149101i",9.0224036498106788,-73.620685716815416,null,8317.6377109999994,-1.3414833500000001,139.35858350000001,5.456804956,-85.032402000000005,4.1153216060000002,54.326181500000004]
[17.067056095808606,8697.4900261778293,8.7898563831937384,128.29605810480945,8.277199712614868,-75.100023840033941,17.067056095808606,53.196034264775506,"-12199.300611469i","-351902.902253914i","9376.79781538598-11874.7649542601i",4750,"-1.70487233007018+2.15904817350183i","1+3.60917678903536i","1+0.00139352250931645i","0.695929958835848-2.49819984126579i","0.999940369657907-0.0116307493616156i","0.66683252408534-2.5061450596791i",8.277199712614868,-75.100023840033941,null,9120.1083940000008,-1.6663657999999999,141.91561870000001,4.6670792490000004,-85.886377100000004,3.0007134490000005,56.029241600000006]
[15.84622980984131,9545.4845666183501,8.3242041509546763,130.73172897581603,7.5220256588866334,-76.475079459489876,15.84622980984131,54.256649516326149,"-11115.5483678275i","-320640.818302715i","9357.62175199665-10867.0604697595i",4750,"-1.7013857730903+1.97582917631991i","1+3.9610670704125i","1+0.00152938923366159i","0.585451281977693-2.30415779285858i","0.999928173397085-0.0127647748601112i","0.555997175532926-2.31146544683775i",7.5220256588866334,-76.475079459489876,null,10000,-1.95643301,144.41981329999999,3.875121671,-86.707341499999998,1.918688661,57.712471799999989]
[14.653896948815555,10476.157527896699,7.8955272949686446,133.18254769352941,6.7583696538469109,-77.752147857505705,14.653896948815555,55.43039983602371,"-10128.0736865647i","-292155.971727827i","9341.17437919724-9953.41425125908i",4750,"-1.69839534167222+1.8097116820471i","1+4.34726621981294i","1+0.00167850279590197i","0.491651889705657-2.1210394037003i","0.999913482216278-0.0140093798914455i","0.461894906302634-2.12774363416914i",6.7583696538469109,-77.752147857505705,null,10964.78196,-2.21339649,146.85269940000001,3.0811931060000002,-87.501750599999994,0.86779661600000013,59.350948800000012]
[13.491735315960188,11497.5699539774,7.5042089267706915,135.62397247241412,5.9875263891894956,-78.937896509842972,13.491735315960188,56.686075962571152,"-9228.32353439107i","-266201.640415126i","9326.88516964119-9125.91928131399i",4750,"-1.69579730357112+1.659258051148i","1+4.77111930951436i","1+0.00184215474637906i","0.412300608057587-1.94924369501739i","0.999895785561275-0.015375350147567i","0.382287336047303-1.95537982189472i",5.9875263891894956,-78.937896509842972,null,12022.64435,-2.4393586200000001,149.19850880000001,2.2854913529999998,-88.275935099999998,-0.15386726700000031,60.922573700000015]
[12.360597033423115,12618.568830660201,7.1499834118942704,138.0312224217887,5.2106136215288457,-80.03917622253158,12.360597033423115,57.992046199257118,"-8408.50470592118i","-242553.020363112i","9314.25862865875-8377.41001422618i",4750,"-1.69350156884704+1.52316545713203i","1+5.23629755221207i","1+0.00202176255999818i","0.34537669507126-1.78885902717194i","0.999874468317046-0.0168745243011669i","0.3151471942281-1.79446253612173i",5.2106136215288457,-80.03917622253158,null,13182.56739,-2.6366989799999998,151.44449270000001,1.488156824,-89.036125100000007,-1.1485421559999998,62.408367600000005]
[11.26054131857607,13848.863713938699,6.8319511112883937,140.38023235511054,4.4285902072876766,-81.06287689360019,11.26054131857607,59.317355461510346,"-7661.51632265725i","-221005.27853819i","9302.85717969701-7701.40046012144i",4750,"-1.69142857812673+1.40025462911299i","1+5.74683009930704i","1+0.00221888191371808i","0.28907912500954-1.63973800381377i","0.999848789356788-0.01851989711544i","0.2586676340422-1.64484377362891i",4.4285902072876766,-81.06287689360019,null,14454.397709999999,-2.80796015,153.5810213,0.68927664,-89.788478299999994,-2.1186835099999999,63.792543000000009]
[10.190908400464696,15199.1108295293,6.548634047811877,142.64852227828212,3.6422743526528203,-82.015821720215612,10.190908400464696,60.632700558066503,"-6980.88832857618i","-201371.778708928i","9292.2860868081-7092.02779968877i",4750,"-1.68950656123783+1.28945959994341i","1+6.30713893948782i","1+0.00243522016108046i","0.241823184377393-1.50156065163451i","0.999817855673556-0.0203257327492778i","0.211258817144402-1.50620238429924i",3.6422743526528203,-82.015821720215612,null,15848.931920000001,-2.9557424600000002,155.60149150000001,-0.11111279,-90.539110399999998,-3.0668552500000001,65.06238110000001]
[9.1504258805057859,16681.0053720006,6.2980646617322913,144.81589869367443,2.8523612187734955,-82.904693499210651,9.1504258805057859,61.911205194463776,"-6360.7254495999i","-183482.464892305i","9282.1799066324-6544.00102711736i",4750,"-1.68766907393316+1.18981836856679i","1+6.92207719988108i","1+0.00267265112048962i","0.202228882151674-1.37388614479999i","0.999780591177329-0.022307689297147i","0.171536286102878-1.37809596112842i",2.8523612187734955,-82.904693499210651,null,17378.008290000002,-3.0826144599999998,157.50208710000001,-0.91302472000000001,-91.294127099999997,-3.99563918,66.207960000000014]
[8.137335365199128,18307.3828029537,6.0778960136262228,146.8649340784977,2.0594393515729053,-83.735987048494181,8.137335365199128,63.128947030003516,"-5795.65613155139i","-167182.388410136i","9272.19002113205-6052.55413463692i",4750,"-1.68585273111492+1.1004643881158i","1+7.59697118151712i","1+0.00293323130533099i","0.169104593685118-1.25619408295731i","0.999735699046578-0.0244829557184176i","0.138304555072997-1.26000224994248i",2.0594393515729053,-83.735987048494181,null,19054.607179999999,-3.1910424599999998,159.2814424,-1.7165224299999999,-92.059656700000005,-4.9075648899999997,67.221785699999998]
[7.1495260599736739,20092.330025650499,5.8855204101193461,148.78120595991112,1.2640056498543277,-84.515982448945422,7.1495260599736739,64.265223510965697,"-5280.78601432198i","-152330.36579775i","9261.97284845838-5613.40336118504i",4750,"-1.68399506335607+1.02061879294273i","1+8.33766649320137i","1+0.00321921773650635i","0.141428411532833-1.14791667867449i","0.999681616287214-0.0268704024420344i","0.110538399904169-1.15135143903499i",1.2640056498543277,-84.515982448945422,null,20892.961309999999,-3.2833399000000001,160.9402546,-2.5217211700000002,-92.841880399999994,-5.8050610700000007,68.098374200000009]
[6.1846631501767311,22051.307399030498,5.7181843919728506,150.55330963686433,0.46647875820388046,-85.250734594709485,6.1846631501767311,65.302575042154842,"-4811.65553926576i","-138797.755940358i","9251.17836549847-5222.7080282286i",4750,"-1.68203243009063+0.949583277859744i","1+9.15057868338133i","1+0.00353308749166907i","0.118328906690633-1.04846330112844i","0.999616458863219-0.0294907470819499i","0.0873635566489617-1.05155078018175i",0.46647875820388046,-85.250734594709485,null,22908.676530000001,-3.3616348500000002,162.48088440000001,-3.3287915199999998,-93.647062599999998,-6.69042637,68.83382180000001]
[5.2403015684563616,24201.282647943801,5.5730906810657102,152.17268268990884,-0.33278911260934807,-85.946075334117751,5.2403015684563616,66.226607355791089,"-4384.20132263575i","-126467.345845262i","9239.43860467442-4877.03447559053i",4750,"-1.67989792812262+0.886733541016458i","1+10.0427488085581i","1+0.00387755916048575i","0.0990664098433731-0.95723876139057i","0.999537955409882-0.032366736870075i","0.0680379416328775-0.960002930819482i",-0.33278911260934807,-85.946075334117751,null,25118.864320000001,-3.4278531800000001,163.90697460000001,-4.1379643699999997,-94.481575599999999,-7.5658175500000002,69.425399000000013]
[4.3139792619867521,26560.877829466801,5.4474811235870177,153.63329235419246,-1.1335018616002661,-86.607625221741884,4.3139792619867521,67.025667132450579,"-3994.72096049797i","-115232.33539898i","9226.35581275304-4573.32258702135i",4750,"-1.67751923868237+0.831513197640244i","1+11.0219044195493i","1+0.00425561639175939i","0.0830154835367415-0.873656583311324i","0.999443367106313-0.0355233496107636i","0.0519340661392062-0.876119265364049i",-1.1335018616002661,-86.607625221741884,null,27542.28703,-3.4837140500000001,165.22310379999999,-4.9495374400000003,-95.351921099999998,-8.43325149,69.871182699999991]
[3.403287498574628,29150.530628251799,5.338698049908265,154.93123925784977,-1.935410551333637,-87.240812555127619,3.403287498574628,67.690426702722149,"-3639.84096027964i","-104995.412315759i","9211.48998476276-4308.85435668515i",4750,"-1.67481636086595+0.783428064851844i","1+12.0965264938379i","1+0.00467053373636797i","0.0696489446758368-0.797148330187218i","0.999329390748616-0.038988015189001i","0.038523006243962-0.799329229255189i",-1.935410551333637,-87.240812555127619,null,30199.517199999998,-3.5307345799999998,166.4344859,-5.7638835799999999,-96.264742999999996,-9.2946181599999989,70.169742900000003]
[2.5059185256960643,31992.671377973798,5.244224225799238,156.06432568706737,-2.7383057001031736,-87.850897929119881,2.5059185256960643,68.213427757947485,"-3316.48752119045i","-95667.9092651092i","9194.34551682906-4081.22389110726i",4750,"-1.67169918487801+0.742040707474046i","1+13.2759228937411i","1+0.0051259050098575i","0.0585235841580182-0.727169879895689i","0.999192041402433-0.0427908599294646i","0.0273600750494953-0.729086631231612i",-2.7383057001031736,-87.850897929119881,null,33113.112150000001,-3.5702407300000001,167.54671909999999,-6.5814607199999999,-97.226832000000002,-10.151701450000001,70.319887099999988]
[1.6196927776101551,35111.917342151297,5.1617034444269034,157.03162685835318,-3.5420106668167484,-88.443003010237447,1.6196927776101551,68.588623848115731,"-3021.85991043051i","-87169.0358778031i","9174.35676474517-3888.30816397357i",4750,"-1.6680648663173+0.706965120722466i","1+14.5703089866618i","1+0.00562567442035328i","0.0492675917349024-0.663205375906251i","0.999026510189644-0.0469649764124065i","0.0180722054003494-0.664873603514359i",-3.5420106668167484,-88.443003010237447,null,36307.805480000003,-3.60338205,168.56558219999999,-7.4028235599999999,-98.245117199999996,-11.00620561,70.320464999999999]
[0.74256882936293422,38535.2859371054,5.0889448151869532,157.8330927103525,-4.346375985824019,-89.022142623675933,0.74256882936293422,68.81095008667657,{"$f":"IMDIV(1,COMPLEX(0,2*PI()*$B98*Cz_adj*10^-9))","v":"-2753.40620458276i"},{"$f":"IMDIV(1,COMPLEX(0,2*PI()*$B98*Cp_Cstray_adj*10^-12))","v":"-79425.178978349i"},{"$f":"IMDIV(IMPRODUCT(IMDIV(IMPRODUCT(J98,IMSUM(Rz_adj*10^3,I98)),IMSUM(J98,IMSUM(Rz_adj*10^3,I98))),Ro_adj*10^3),IMSUM(IMDIV(IMPRODUCT(J98,IMSUM(Rz_adj*10^3,I98)),IMSUM(J98,IMSUM(Rz_adj*10^3,I98))),Ro_adj*10^3))","v":"9150.87235968257-3728.23774167118i"},{"$f":"IF($E$1=\"Feedforward RC\",IMDIV(IMPRODUCT(IMSUM(Rz_2_adj*10^3,IMDIV(1,COMPLEX(0,2*PI()*$B98*Cz_2_adj*10^-12))),RFB1_adj*10^3),IMSUM(IMSUM(Rz_2_adj*10^3,IMDIV(1,COMPLEX(0,2*PI()*$B98*Cz_2_adj*10^-12))),RFB1_adj*10^3)),RFB1_adj*10^3)","v":4750},{"$f":"IMPRODUCT(-gm_EA2*10^-6,K98,IMDIV(RFB2_adj*10^3,IMSUM(L98,RFB2_adj*10^3)))","v":"-1.66379497448774+0.677861407576577i"},{"$f":"COMPLEX(1,2*PI()*B98*1/(1/(Vout_sync_buck/Iout_sync_buck*Number_Cout2*Co_2*10^-6)+(mc_adj*(1-Vout_sync_buck/Vreg)-0.5)/(fsw*10^3*L_buck2*10^-6*Number_Cout2*Co_2*10^-6)))","v":"1+15.9908961257138i"},{"$f":"COMPLEX(1,2*PI()*B98*(ESR_2*10^-3*Co_2*10^-6))","v":"1+0.00617417073140361i"},{"$f":"IMPRODUCT(K_adj,IMDIV(O98,N98))","v":"0.0415696088118626-0.604769436025626i"},{"$f":"IMDIV(1,IMSUM(COMPLEX(1,2*PI()*B98/(wn_adj*Qp_adj)),IMPRODUCT(COMPLEX(0,2*PI()*B98/wn_adj),COMPLEX(0,2*PI()*B98/wn_adj))))","v":"0.998826991734155-0.0515467217128012i"},"0.0103469654978977-0.606202813535373i",-4.346375985824019,-89.022142623675933,null,39810.717060000003,-3.6311484599999999,169.49687410000001,-8.2286369500000003,-99.326641199999997,{"$f":"W98+Y98","v":-11.859785410000001},{"$f":"X98+Z98","v":70.170232900000016}]
[{"$f":"ABS(G99)","v":0.12736040573881535},42292.428743894998,{"$f":"20*LOG(IMABS(M99))","v":5.023914111747521},{"$f":"IF(180/PI()*IMARGUMENT(M99)>0,180/PI()*IMARGUMENT(M99),360+180/PI()*IMARGUMENT(M99))","v":158.46919761745409},{"$f":"S99","v":-5.1512745174863364},-89.593259569607241,{"$f":"C99+E99","v":-0.12736040573881535},68.875938047846844,"-2508.80118607312i","-72369.2649828786i","9123.13823096626-3599.3665753077i",4750,"-1.65875240563023+0.654430286419581i","1+17.5499887570985i","1+0.00677614475565881i","0.0351692837894889-0.551408077261616i","0.998586474497327-0.0565760474500353i",{"$f":"IMPRODUCT(P99,Q99)","v":"0.00392308156645579-0.552618386950485i"},{"$f":"20*LOG(IMABS(R99))","v":-5.1512745174863364},{"$f":"180/PI()*IMARGUMENT(R99)","v":-89.593259569607241},null,43651.58322,-3.65438763,170.34629219999999,-9.0596908200000001,-100.478515,-12.714078450000001,69.867777199999992]
[0.99188191886066779,46415.888336127799,4.9647153731473468,158.94064733952209,-5.9565972920080146,-90.161261857796276,-0.99188191886066779,68.779385481725811,"-2285.9262032482i","-65940.1789398519i","9090.2794344191-3500.23981279421i",4750,"-1.65277807898529+0.636407238689855i","1+19.2610909953327i","1+0.00743681050413779i","0.0298491816790039-0.502698713223015i","0.998296485596475-0.0620968655251357i","-0.00141768122658803-0.503695899345163i",-5.9565972920080146,-90.161261857796276,null,47863.009230000003,-3.6738220699999999,171.1193418,-9.8969162500000003,-101.707847,-13.57073832,69.4114948]
[1.8526844140688272,50941.380148163902,4.9095655233293742,159.24814683038073,-6.7622499373982015,-90.731062284369429,-1.8526844140688272,68.517084546011304,"-2082.85081962824i","-60082.2351815836i","9051.28110380322-3429.55843018975i",4750,"-1.64568747341876+0.623556078216317i","1+21.1390235894271i","1+0.00816189034749703i","0.0254278933052877-0.458249497949559i","0.997946779615428-0.0681574539882078i","-0.00585743483519983-0.459041711207121i",-6.7622499373982015,-90.731062284369429,null,52480.746019999999,-3.6900651999999998,171.82127249999999,-10.7414022,-103.021641,-14.431467399999999,68.79963149999999]
[2.7113853395817227,55908.101825122198,4.8567642570357634,159.39222909307938,-7.5681495966174861,-91.307620485568862,-2.7113853395817227,68.084608607510518,"-1897.81609338988i","-54744.6950016311i","9004.96915690125-3386.13933098277i",4750,"-1.63726711943659+0.615661696542321i","1+23.2000522931247i","1+0.00895766458046765i","0.0217541932253963-0.417698224324717i","0.997524958243205-0.0748109081230408i","-0.00954803279433563-0.41829185472845i",-7.5681495966174861,-91.307620485568862,null,57543.993730000002,-3.7036362600000001,172.4570344,-11.594412,-104.42665700000001,-15.29804826,68.030377399999992]
[3.5695613010434446,61359.072734131798,4.80466095270328,159.37314368909659,-8.3742222537467246,-91.895987803814123,-3.5695613010434446,67.477155885282471,"-1729.21934225345i","-49881.327180388i","8949.99182421264-3368.86944412211i",4750,"-1.62727124076593+0.61252171711311i","1+25.4620287510788i","1+0.00983102581876414i","0.0187021052402797-0.380710933517156i","0.997016004123866-0.0821156425518359i","-0.0126160246969029-0.381110629050419i",-8.3742222537467246,-91.895987803814123,null,63095.734450000004,-3.7149736500000001,173.03125159999999,-12.457398299999999,-105.92922900000001,-16.172371949999999,67.102022599999984]
[4.4287804146691494,67341.506577508306,4.7516199900253122,159.19080328645776,-9.1804004046944616,-92.50135550459899,-4.4287804146691494,66.689447781858775,"-1575.60026181586i","-45450.0075523806i","8884.80365383622-3376.65231346971i",4750,"-1.61541884615204+0.613936784267219i","1+27.9445451212577i","1+0.010789538699624i","0.0161667471738606-0.346980351659197i","0.996401707806133-0.0901359509251861i","-0.0151668294554525-0.34718902009828i",-9.1804004046944616,-92.50135550459899,null,69183.097089999996,-3.72444687,173.54820749999999,-13.3320147,-107.535033,-17.05646157,66.013174499999991]
[5.2906354129982711,73907.220335257705,4.6959856123484842,158.84478727489125,-9.9866210253467553,-93.129107102293162,-5.2906354129982711,65.715680172598084,"-1435.62827709243i","-41412.3541468972i","8807.65439984298-3408.34578450546i",4750,"-1.60139170906236+0.619699233546446i","1+30.6691037728452i","1+0.0118415054030769i","0.0140608405543573-0.316224238946846i","0.995659960787496-0.0989426305109939i","-0.0172882420777474-0.316243029901516i",-9.9866210253467553,-93.129107102293162,null,75857.757500000007,-3.7323669100000001,174.0118386,-14.2201222,-109.248811,-17.952489110000002,64.763027600000001]
[6.1567764091376862,81113.083078968702,4.6360474014202904,158.33440252398185,-10.792823810557977,-93.784875803390875,-6.1567764091376862,64.549526720590976,"-1308.09101771287i","-37733.3947417174i","8716.58612177311-3462.6897601378i",4750,"-1.58483384032238+0.62957995638869i","1+33.6593035294761i","1+0.0129960375614562i","0.0123117847788649-0.288183712625865i","0.994763879862263-0.108613679610301i","-0.0190533746374-0.28801197633222i",-10.792823810557977,-93.784875803390875,null,83176.377110000001,-3.7389953899999999,174.42573619999999,-15.1237867,-111.074039,-18.86278209,63.35169719999999]
[7.0289421538888606,89021.5085445039,4.5700075292984872,157.65880237652721,-11.598949683187348,-94.474608373318929,-7.0289421538888606,63.184194003208276,"-1191.88381694917i","-34381.263950457i","8609.44286793467-3538.22374962984i",4750,"-1.56535324871539+0.643313409023606i","1+36.9410440709561i","1+0.0142631351799996i","0.0108592085765249-0.262621587335026i","0.993680717630202-0.119235075982197i","-0.0205231187492397-0.26225680592798i",-11.598949683187348,-94.474608373318929,null,91201.083939999997,-3.7445523600000001,174.7931514,-16.045265700000002,-113.012565,-19.789818060000002,61.780586400000004]
[7.9089883941913808,97700.995729922506,4.4959512125648811,156.81716551555172,-12.404939606756262,-95.20463709587321,-7.9089883941913808,61.612528419678512,"-1086.00014362086i","-31326.9272198325i","8483.89837444252-3633.19523041383i",4750,"-1.54252697717136+0.660580950984332i","1+40.5427502638989i","1+0.0156537732521101i","0.00965292373305253-0.239320762735992i","0.992370500173096-0.130901643949017i","-0.0217482045201719-0.238758448603694i",-12.404939606756262,-95.20463709587321,null,100000,-3.7492231199999999,175.11700339999999,-16.986979999999999,-115.064215,-20.736203119999999,60.052788399999983]
[8.7989115876722828,107226.722201033,4.4118221953704158,155.80893595412221,-13.210733783042699,-95.981761943437476,-8.7989115876722828,59.827174010684729,"-989.52288400339i","-28543.9293462517i","8337.50807194997-3745.46183881045i",4750,"-1.51591055853636+0.680993061601899i","1+44.4956183643226i","1+0.0171799968194992i","0.00865121693480812-0.218082678251977i","0.990784314289167-0.143718015870218i","-0.0227709197755166-0.217316232562964i",-13.210733783042699,-95.981761943437476,null,109647.8196,-3.7531639499999998,175.39988980000001,-17.951467300000001,-117.22640800000001,-21.704631250000002,58.173481800000005]
[9.7008657990050775,117681.1952435,4.3154055850674613,154.63412357542504,-14.016271384072539,-96.813345634444005,-9.7008657990050775,57.820777940981031,"-901.616398227882i","-26008.1653334966i","8167.79200348975-3872.39320630741i",4750,"-1.48505309154359+0.704071492055891i","1+48.8338862246939i","1+0.0188550253005749i","0.0078194252009296-0.198725847262098i","0.988862141562867-0.157799689009156i","-0.0236265433460582-0.19774636977243i",-14.016271384072539,-96.813345634444005,null,120226.44349999999,-3.7565071200000002,175.64409710000001,-18.9413172,-119.493804,-22.697824320000002,56.150293100000013]
[10.617170189559003,129154.966501488,4.2043208772531759,153.2936609073171,-14.821491066812179,-97.707424946372782,-10.617170189559003,55.586235960944322,"-821.519282368244i","-23697.6716067762i","7972.35452121321-4010.78182527501i",4750,"-1.44951900385694+0.72923305914091i","1+53.5951298458297i","1+0.0206933669907212i","0.00712874874357697-0.181084477628442i","0.986530102622382-0.173274169429024i","-0.0243445372279868-0.179880516315719i",-14.821491066812179,-97.707424946372782,null,131825.67389999999,-3.75936512,175.85161149999999,-19.959086200000002,-121.858042,-23.71845132,53.993569499999992]
[11.550304254048884,141747.41629268101,4.0760284094134285,151.78980577314456,-15.626332663462312,-98.672842500507684,-11.550304254048884,53.11696327263688,"-748.537773524664i","-21592.4357747499i","7749.04423554642-4156.77635745536i",4750,"-1.40891713373571+0.755777519537337i","1+58.8205888422385i","1+0.0227109447262115i","0.00655526231936959-0.165007181482263i","0.983696929154414-0.190282177028688i","-0.0249495343044473-0.163564407297651i",-15.626332663462312,-98.672842500507684,null,144543.97709999999,-3.7618343099999998,176.02412939999999,-21.007195100000001,-124.30761099999999,-24.769029410000002,51.716518399999998]
[12.50288805687673,155567.614393047,3.9278525957128658,150.1265710378778,-16.430740652589595,-99.719404252840917,-12.50288805687673,50.407166785036878,"-682.039740781286i","-19674.2232917679i","7496.15303919907-4305.85458136033i",4750,"-1.36293691621801+0.782882651156422i","1+64.5555236399311i","1+0.024925233800198i","0.00607909232102042-0.150355774389215i","0.980249419740232-0.208978854507985i","-0.0254621507802916-0.148656562349316i",-16.430740652589595,-99.719404252840917,null,158489.3192,-3.7639980999999998,176.16306700000001,-22.087816799999999,-126.8279,-25.851814899999997,49.335167000000013]
[13.477645427927248,170735.26474706901,3.7570249004869662,148.31015233801318,-17.234670328414214,-100.85806910646266,-13.477645427927248,47.452083231550517,"-621.449209990571i","-17926.4195189588i","7212.64578724819-4452.85550683662i",4750,"-1.31139014313603+0.809610092152111i","1+70.8496075005823i","1+0.0273554133253431i","0.00568373212495009-0.137004162063981i","0.976046553733527-0.229534868625629i","-0.0258996451876182-0.135027054936302i",-17.234670328414214,-100.85806910646266,null,173780.08290000001,-3.7659296900000001,176.26956809999999,-23.2027602,-129.40146799999999,-26.96868989,46.868100099999992]
[14.477349661136447,187381.74228603899,3.5607483825517301,146.34931374475465,-18.038098043688176,-102.10117834994716,-14.477349661136447,44.248135394807491,"-566.241374960799i","-16333.8858161769i","6898.40268759896-4592.08942938509i",4750,"-1.2542550341089+0.834925350797288i","1+77.7573567675569i","1+0.0300225323541165i","0.00535547267399724-0.124837311492567i","0.970911830347729-0.25213719938114i","-0.0262764383217189-0.122556336478322i",-18.038098043688176,-102.10117834994716,null,190546.07180000001,-3.7676944899999998,176.34451189999999,-24.3533644,-132.00853499999999,-28.12105889,44.335976899999991]
[15.504753937269214,205651.23083486501,3.3362836347985736,144.25568205419538,-18.841037572067787,-103.46273387494989,-15.504753937269214,40.792948179245485,"-515.938051835909i","-14882.8284183435i","6554.4459886742-4717.53912379794i",4750,"-1.19171745248622+0.857734386145079i","1+85.3386030603965i","1+0.032949692195618i","0.00508292904265807-0.113750302479071i","0.964623264195997-0.276989257124808i","-0.0266045001765946-0.111134104820187i",-18.841037572067787,-103.46273387494989,null,208929.61309999999,-3.7693523299999998,176.38851779999999,-25.540413699999998,-134.62768600000001,-29.309766029999999,41.760831799999977]
[16.562512537545203,225701.97196339199,3.0810530744905904,142.04389597870804,-19.643565612035793,-104.95873500584256,-16.562512537545203,37.085160972865481,"-470.103537295661i","-13560.6789604518i","6183.11374710851-4823.15385601254i",4750,"-1.12420249947427+0.876937064729551i","1+93.6590115076872i","1+0.036162246508067i","0.00485664690421479-0.103647455136799i","0.956900304839166-0.304309709786813i","-0.0268936000896817-0.100658206226165i",-19.643565612035793,-104.95873500584256,null,229086.7653,-3.7709594499999999,176.40195009999999,-26.764084100000002,-137.236729,-30.535043550000001,39.165221099999997]
[17.653103759116409,247707.63559917099,2.7927571047382029,139.731560336218,-20.445860863854612,-106.60758362358636,-17.653103759116409,33.123976712631631,"-428.340834701956i","-12355.9856164026i","5788.13990536099-4903.22083161234i",4750,"-1.052389073702+0.891494696656787i","1+102.790649506987i","1+0.0396880209000591i","0.0046687754824882-0.0944415285960597i","0.947386770206455-0.334328980804662i","-0.0271514038759814-0.0910335616986476i",-20.445860863854612,-106.60758362358636,null,251188.64319999999,-3.77257036,176.38491980000001,-28.0239294,-139.81363200000001,-31.79649976,36.571287799999993]
[18.778770835222055,271858.82427329401,2.4694922841216798,137.33896992244777,-21.248263119343733,-108.43056482483945,-18.778770835222055,28.908405097608323,"-390.288215503843i","-11258.3139087647i","5374.60516767314-4952.77884728079i",4750,"-0.977200939576933+0.900505244960142i","1+112.812610938147i","1+0.0435575539426775i","0.00451279580284272-0.0860529861313462i","0.935628734943711-0.367281699125927i","-0.0273833855331076-0.0821711138624766i",-21.248263119343733,-108.43056482483945,null,275422.87030000001,-3.7742397200000002,176.3372856,-29.318907200000002,-142.33745300000001,-33.093146920000002,33.999832599999991]
[19.941502428789537,298364.72402833402,2.1098591768164257,134.88859333740069,-22.051361605605962,-110.45240331360419,-19.941502428789537,24.436190023796499,"-355.616086117878i","-10258.1563303234i","4948.73910404884-4968.02140710936i",4750,"-0.899770746190697+0.903276619474427i","1+123.811701236665i","1+0.0478043616799858i","0.0043832949243284-0.0784093219656443i","0.921046299696038-0.403392310174164i","-0.027592499956382-0.0739868033238315i",-22.051361605605962,-110.45240331360419,null,301995.17200000002,-3.7760241699999999,176.25865279999999,-30.647442600000002,-144.78916599999999,-34.423466770000005,31.469486799999999]
[21.143078691228023,327454.916287773,1.7130469037573062,132.40434047310862,-22.856125594985329,-112.70187997768551,-21.143078691228023,19.702460495423111,"-324.024133146168i","-9346.84999460102i","4517.57903954081-4946.62771117261i",4750,"-0.821378007189237+0.899386856576837i","1+135.883189260835i","1+0.0524652279289679i","0.00427577839494581-0.0714444451496792i","0.902898515504349-0.442849412564212i","-0.0277785366000894-0.0664006094171337i",-22.856125594985329,-112.70187997768551,null,331131.12150000001,-3.7779841799999998,176.14837120000001,-32.007519899999998,-147.152321,-35.785504079999995,28.996050200000013]
[22.385211897198577,359381.36638046301,1.2788831639501275,129.91067211781424,-23.664095061148704,-115.21246166138599,-22.385211897198577,14.698210456428257,"-295.238722205396i","-8516.50160207872i","4088.52009508643-4887.96474201786i",4750,"-0.743367290015713+0.888720862185064i","1+149.131632465026i","1+0.0575805228833541i","0.00418651447404974-0.0650981161096513i","0.880241914757551-0.485761982426168i","-0.0279370444168353-0.0593357399418391i",-23.664095061148704,-115.21246166138599,null,363078.05479999998,-3.7801861300000001,176.0055299,-33.396791999999998,-149.413509,-37.176978129999995,26.592020899999994]
[23.66981186274543,394420.60594376602,0.80784261623194098,127.43163779472164,-24.477654478977371,-118.0228386852569,-23.66981186274543,9.4087991094647379,"-269.010527836683i","-7759.91907221204i","3668.81499407181-4793.12323190693i",4750,"-0.667057271649419+0.871476951255804i","1+163.67178252633i","1+0.0631945527809259i","0.00411240475158016-0.0593154316871376i","0.851885988959068-0.532087420835834i","-0.0280576950733733-0.0527181440210326i",-24.477654478977371,-118.0228386852569,null,398107.17060000001,-3.7827045099999999,175.82895239999999,-34.812693899999999,-151.56260399999999,-38.595398410000001,24.266348399999998]
[24.999404867059958,432876.12810830597,0.30101224836528778,124.98994103362605,-25.300417115425248,-121.17716235532522,-24.999404867059958,3.8127786783008304,"-245.112373967755i","-7070.54924906984i","3265.09403006954-4664.78035162048i",4750,"-0.593653460012643+0.848141882112813i","1+179.629579268695i","1+0.0693559436629519i","0.00405087669839048-0.0540463547436349i","0.816355086414198-0.581517736073155i","-0.0281219600563574-0.046476673243872i",-25.300417115425248,-121.17716235532522,null,436515.8322,-3.7854801600000001,175.61718400000001,-36.252524200000003,-153.59403599999999,-40.038004360000002,22.02314800000002]
[26.377727782949499,475081.01621027902,-0.23998158907056144,122.60612602471355,-26.137746193878936,-124.72460742229886,-26.377727782949499,-2.1184813975853132,"-223.33726622247i","-6442.42114103282i","2882.97082192863-4506.91410113998i",4750,"-0.524176513077932+0.819438927479995i","1+197.143241493429i","1+0.0761180625496955i","0.00399979443518115-0.0492452846586302i","0.771877889350386-0.633307929264866i","-0.0281000763667529-0.0405444479139921i",-26.137746193878936,-124.72460742229886,null,478630.09230000002,-3.7888706000000001,175.3685031,-37.713646599999997,-155.50204600000001,-41.5025172,19.866457099999991]
[27.810499082653624,521400.82879996998,-0.8130748531112485,120.2979575520453,-26.997424229542375,-128.71763608333822,-27.810499082653624,-8.4196785312929165,"-203.496599034564i","-5870.09420292012i","2526.77983305969-4324.41932408331i",4750,"-0.459414515101761+0.786258058924237i","1+216.364464164339i","1+0.0835394796800144i","0.00395738463443841-0.0448706653061832i","0.716445393327307-0.686034604158856i","-0.0279475791207042-0.0348622842553377i",-26.997424229542375,-128.71763608333822,null,524807.46019999997,-3.79287011,175.08088169999999,-39.193416300000003,-157.28744499999999,-42.986286410000005,17.793436700000001]
[29.306320088328953,572236.76593502203,-1.4158837302059841,118.08003342340189,-27.890436358122969,-133.20802922317455,-29.306320088328953,-15.127995799772663,"-185.418522036463i","-5348.61121259025i","2199.46372744733-4122.68666387766i",4750,"-0.399902495899514+0.749579393432301i","1+237.459732316928i","1+0.0916844758187478i","0.0039221749912984-0.0408846273453866i","0.648006117952304-0.737293258285125i","-0.0276023667192123-0.0293852818289094i",-27.890436358122969,-133.20802922317455,null,575439.93729999999,-3.7976129099999998,174.75199459999999,-40.6893368,-158.95300399999999,-44.486949709999998,15.798990599999996]
[30.877560180440636,628029.14418342605,-2.0458260130277042,115.96363369167278,-28.831734167412932,-138.23949869593284,-30.877560180440636,-22.275865004260055,"-168.946451573604i","-4873.45533385396i","1902.60101775771-3907.2024258873i",4750,"-0.345927457774128+0.710400441070417i","1+260.611763072141i","1+0.100623599025954i","0.00389294313296507-0.0372526619010814i","0.564892824557391-0.783396394727571i","-0.0269845053850904-0.0240934790188277i",-28.831734167412932,-138.23949869593284,null,630957.34450000001,-3.8031516600000002,174.3792028,-42.1990178,-160.50862900000001,-46.002169459999998,13.870573799999988]
[32.540909928428675,689261.21043497103,-2.7002349206315159,113.95678142886091,-29.840675007797156,-143.8358370013932,-32.540909928428675,-29.879055572532295,"-153.937714451737i","-4440.51099380009i","1636.54410504766-3683.21279761221i",4750,"-0.297553473645029+0.66967505411131i","1+286.021088244643i","1+0.110434275710453i","0.00386867419688846-0.0339433229405913i","0.466563570227231-0.819236297304341i","-0.0260026197587093-0.0190060762610739i",-29.840675007797156,-143.8358370013932,null,691830.97089999996,-3.8098650799999998,173.95954599999999,-43.720449299999999,-161.95551800000001,-47.53031438,12.004027999999977]
[34.317072557486945,756463.32755462895,-3.3764574587257803,112.06447037875925,-30.940615098761164,-149.98471639405184,-34.317072557486945,-37.920246015292591,"-140.262312169964i","-4046.02823567203i",{"$f":"IMDIV(IMPRODUCT(IMDIV(IMPRODUCT(J130,IMSUM(Rz_adj*10^3,I130)),IMSUM(J130,IMSUM(Rz_adj*10^3,I130))),Ro_adj*10^3),IMSUM(IMDIV(IMPRODUCT(J130,IMSUM(Rz_adj*10^3,I130)),IMSUM(J130,IMSUM(Rz_adj*10^3,I130))),Ro_adj*10^3))","v":"1400.62797419945-3455.47630132225i"},4750,{"$f":"IMPRODUCT(-gm_EA2*10^-6,K130,IMDIV(RFB2_adj*10^3,IMSUM(L130,RFB2_adj*10^3)))","v":"-0.254659631672627+0.628268418422226i"},"1+313.907791253476i","1+0.121201481260341i",{"$f":"IMPRODUCT(K_adj,IMDIV(O130,N130))","v":"0.00384852560761584-0.0309279558685979i"},"0.354622573703653-0.838605300471257i","-0.0245715736682102-0.0141951452830612i",-30.940615098761164,-149.98471639405184,null,758577.57499999995,-3.81788792,173.4897268,-45.251680999999998,-163.310057,-49.069568919999995,10.179669799999999]
[36.228950531241679,830217.56813197501,-4.0719329337370702,110.28900663513424,-32.157017597504606,-156.62005072295281,-36.228950531241679,-46.331044087818569,"-127.801794935915i","-3686.59023853602i","1193.4099148066-3228.10958825836i",4750,"-0.216983620873927+0.586929016046973i","1+344.513413379342i","1+0.133018476059154i","0.00383179783129085-0.0281804500650395i","0.233798430678355-0.835304541531986i","-0.0226433896021103-0.00978926313172564i",-32.157017597504606,-156.62005072295281,null,831763.77110000001,-3.8273996399999999,172.966106,-46.790997699999998,-164.59417300000001,-50.618397340000001,8.3719329999999843]
[38.297963157384331,911162.75611549104,-4.7842504155617611,108.63041287724694,-33.513712741822566,-163.60989072759668,-38.297963157384331,-54.979477850349738,"-116.448235710315i","-3359.08372241293i","1012.90763134006-3004.51757883532i",4750,"-0.184165023880011+0.546275923424603i","1+378.103045879627i","1+0.14598761326269i","0.00381791009371569-0.0256770132798699i","0.112185156250353-0.80509180926204i","-0.0202440402375226-0.00595434789179396i",-33.513712741822566,-163.60989072759668,null,912010.83940000006,-3.83886891,172.38469660000001,-48.337237700000003,-165.822632,-52.176106610000005,6.5620646000000136]
[40.539043132883023,1000000,-5.5111863533181946,107.08685146525221,-35.027856779564829,-170.75929199255316,-40.539043132883023,-63.672440527300949,"-106.103295394597i","-3060.67198253645i","856.813243245546-2787.39086403976i",4750,"-0.155784226044644+0.506798338916319i","1+414.967626082054i","1+0.160221225333079i","0.00380638021981327-0.0233959659738965i","-0.747813323562752i","-0.0174958150729006-0.00284646184292208i",-35.027856779564829,-170.75929199255316,null,1000000,-3.8525983199999998,171.74116219999999,-49.8894576,-167.03278900000001,-53.742055919999999,4.7083731999999827]
[0.70449925193441487,{"$f":"100","v":100},{"$f":"C135","v":4.983892354926903},null,{"$f":"E135","v":-5.6883916068613178},null,-0.70449925193441487]
[{"$f":"ABS(G135)","v":0.70449925193441487},{"$f":"fc_2*1000","v":45000},{"$f":"20*LOG(IMABS(M135))","v":4.983892354926903},{"$f":"IF(180/PI()*IMARGUMENT(M135)>0,180/PI()*IMARGUMENT(M135),360+180/PI()*IMARGUMENT(M135))","v":158.80189910532008},{"$f":"S135","v":-5.6883916068613178},{"$f":"T135","v":-89.972165892719801},{"$f":"C135+E135","v":-0.70449925193441487},{"$f":"D135+F135","v":68.829733212600274},{"$f":"IMDIV(1,COMPLEX(0,2*PI()*$B135*Cz_adj*10^-9))","v":"-2357.85100876882i"},{"$f":"IMDIV(1,COMPLEX(0,2*PI()*$B135*Cp_Cstray_adj*10^-12))","v":"-68014.9329452546i"},{"$f":"IMDIV(IMPRODUCT(IMDIV(IMPRODUCT(J135,IMSUM(Rz_adj*10^3,I135)),IMSUM(J135,IMSUM(Rz_adj*10^3,I135))),Ro_adj*10^3),IMSUM(IMDIV(IMPRODUCT(J135,IMSUM(Rz_adj*10^3,I135)),IMSUM(J135,IMSUM(Rz_adj*10^3,I135))),Ro_adj*10^3))","v":"9101.84974540323-3530.02778145502i"},{"$f":"IF($E$1=\"Feedforward RC\",IMDIV(IMPRODUCT(IMSUM(Rz_2_adj*10^3,IMDIV(1,COMPLEX(0,2*PI()*$B135*Cz_2_adj*10^-12))),RFB1_adj*10^3),IMSUM(IMSUM(Rz_2_adj*10^3,IMDIV(1,COMPLEX(0,2*PI()*$B135*Cz_2_adj*10^-12))),RFB1_adj*10^3)),RFB1_adj*10^3)","v":4750},{"$f":"IMPRODUCT(-gm_EA2*10^-6,K135,IMDIV(RFB2_adj*10^3,IMSUM(L135,RFB2_adj*10^3)))","v":"-1.65488177189149+0.641823232991821i"},{"$f":"COMPLEX(1,2*PI()*B135*1/(1/(Vout_sync_buck/Iout_sync_buck*Number_Cout2*Co_2*10^-6)+(mc_adj*(1-Vout_sync_buck/Vreg)-0.5)/(fsw*10^3*L_buck2*10^-6*Number_Cout2*Co_2*10^-6)))","v":"1+18.6735431736924i"},{"$f":"COMPLEX(1,2*PI()*B135*(ESR_2*10^-3*Co_2*10^-6))","v":"1+0.00720995513998858i"},{"$f":"IMPRODUCT(K_adj,IMDIV(O135,N135))","v":"0.0315126283047095-0.518426638263166i"},{"$f":"IMDIV(1,IMSUM(COMPLEX(1,2*PI()*B135/(wn_adj*Qp_adj)),IMPRODUCT(COMPLEX(0,2*PI()*B135/wn_adj),COMPLEX(0,2*PI()*B135/wn_adj))))","v":"0.998399135045542-0.060201019942113i"},{"$f":"IMPRODUCT(P135,Q135)","v":"0.000252368453830167-0.519493799591513i"},{"$f":"20*LOG(IMABS(R135))","v":-5.6883916068613178},{"$f":"180/PI()*IMARGUMENT(R135)","v":-89.972165892719801}]
[{"$f":"ABS(G136)","v":0.70449925193441487},{"$f":"B133","v":1000000},{"$f":"C135","v":4.983892354926903},null,{"$f":"E135","v":-5.6883916068613178},null,{"$f":"C136+E136","v":-0.70449925193441487}]
[null,null,"Error Amplifier"]
[{"$f":"ABS(G138)","v":0.70449925193441487},{"$f":"fc_2*1000","v":45000},{"$f":"20*LOG(IMABS(M138))","v":4.983892354926903},{"$f":"IF(180/PI()*IMARGUMENT(M138)>0,180/PI()*IMARGUMENT(M138),360+180/PI()*IMARGUMENT(M138))","v":158.80189910532008},{"$f":"S138","v":-5.6883916068613178},{"$f":"T138","v":-89.972165892719801},{"$f":"C138+E138","v":-0.70449925193441487},{"$f":"D138+F138","v":68.829733212600274},{"$f":"IMDIV(1,COMPLEX(0,2*PI()*$B138*Cz_adj*10^-9))","v":"-2357.85100876882i"},{"$f":"IMDIV(1,COMPLEX(0,2*PI()*$B138*Cp_Cstray_adj*10^-12))","v":"-68014.9329452546i"},{"$f":"IMDIV(IMPRODUCT(IMDIV(IMPRODUCT(J138,IMSUM(Rz_adj*10^3,I138)),IMSUM(J138,IMSUM(Rz_adj*10^3,I138))),Ro_adj*10^3),IMSUM(IMDIV(IMPRODUCT(J138,IMSUM(Rz_adj*10^3,I138)),IMSUM(J138,IMSUM(Rz_adj*10^3,I138))),Ro_adj*10^3))","v":"9101.84974540323-3530.02778145502i"},{"$f":"IF($E$1=\"Feedforward RC\",IMDIV(IMPRODUCT(IMSUM(Rz_2_adj*10^3,IMDIV(1,COMPLEX(0,2*PI()*$B138*Cz_2_adj*10^-12))),RFB1_adj*10^3),IMSUM(IMSUM(Rz_2_adj*10^3,IMDIV(1,COMPLEX(0,2*PI()*$B138*Cz_2_adj*10^-12))),RFB1_adj*10^3)),RFB1_adj*10^3)","v":4750},{"$f":"IMPRODUCT(-gm_EA2*10^-6,K138,IMDIV(RFB2_adj*10^3,IMSUM(L138,RFB2_adj*10^3)))","v":"-1.65488177189149+0.641823232991821i"},{"$f":"COMPLEX(1,2*PI()*B138*1/(1/(Vout_sync_buck/Iout_sync_buck*Number_Cout2*Co_2*10^-6)+(mc_adj*(1-Vout_sync_buck/Vreg)-0.5)/(fsw*10^3*L_buck2*10^-6*Number_Cout2*Co_2*10^-6)))","v":"1+18.6735431736924i"},{"$f":"COMPLEX(1,2*PI()*B138*(ESR_2*10^-3*Co_2*10^-6))","v":"1+0.00720995513998858i"},{"$f":"IMPRODUCT(K_adj,IMDIV(O138,N138))","v":"0.0315126283047095-0.518426638263166i"},{"$f":"IMDIV(1,IMSUM(COMPLEX(1,2*PI()*B138/(wn_adj*Qp_adj)),IMPRODUCT(COMPLEX(0,2*PI()*B138/wn_adj),COMPLEX(0,2*PI()*B138/wn_adj))))","v":"0.998399135045542-0.060201019942113i"},{"$f":"IMPRODUCT(P138,Q138)","v":"0.000252368453830167-0.519493799591513i"},{"$f":"20*LOG(IMABS(R138))","v":-5.6883916068613178},{"$f":"180/PI()*IMARGUMENT(R138)","v":-89.972165892719801}]
[]
[null,"Cz = infinity",{"$f":"20*LOG(IMABS((-gm_EA2*10^-6*Rz_adj*10^3)))","v":17.501225267834002}]
[null,null,{"$f":"Rz_adj","v":10}]

{"sheet":"Diode Curve","index":3,"n_rows":70,"n_cols":15,"rows_kept":70,"cut":false,"hidden":false,"merged":[[55,4,55,6],[68,5,68,6],[69,5,69,6],[55,8,55,10],[68,9,68,10],[69,9,69,10]]}
[]
[]
[]
[]
[]
[]
[]
[]
[]
[]
[]
[]
[]
[]
[]
[]
[]
[]
[]
[]
[]
[]
[]
[]
[]
[]
[]
[]
[]
[]
[]
[]
[]
[]
[]
[]
[]
[]
[]
[]
[]
[null,null,null,"If",0.01,0.02,0.05,0.1,0.2,0.5,1,2,5,10,20]
[null,null,null,"Vf 25",0.34,0.35,0.36499999999999999,0.38,0.41,0.45,0.51,0.6,0.8,0.98,1.2]
[null,null,null,"Vf 150",0.08,0.1,0.13300000000000001,0.2,0.24,0.32500000000000001,0.4,0.5,0.64,0.76,0.98]
[null,null,null,"delta",{"$f":"E43-E44","v":0.26},{"$f":"F43-F44","v":0.24999999999999997},0.23199999999999998,0.18,0.16999999999999998,0.125,0.10999999999999999,9.9999999999999978E-2,0.16000000000000003,0.21999999999999997,0.21999999999999997]
[null,null,null,null,0.01,0.3,{"$f":"F46","v":0.3},3,{"$f":"H46","v":3},10]
[null,null,null,null,0.08,0.20499999999999999,{"$f":"F47","v":0.20499999999999999},0.4,{"$f":"H47","v":0.4},0.61]
[null,null,null,null,25,{"$f":"E48","v":25},{"$f":"F48","v":25},25,25,25,25,25,25,25,{"$f":"N48","v":25}]
[null,null,null,null,{"$f":"IF(Reset=1,0.45,FORECAST(E42, OFFSET(Vd_1:Vd_3,MATCH(E42,I_Vd1:I_Vd3,1)-1,0,2), OFFSET(I_Vd1:I_Vd3,MATCH(E42,I_Vd1:I_Vd3,1)-1,0,2))+(E48-25)*vd_temp_coeff/1000)","v":0.34},{"$f":"IF(Reset=1,0.45,FORECAST(F42, OFFSET(Vd_1:Vd_3,MATCH(F42,I_Vd1:I_Vd3,1)-1,0,2), OFFSET(I_Vd1:I_Vd3,MATCH(F42,I_Vd1:I_Vd3,1)-1,0,2))+(F48-25)*vd_temp_coeff/1000)","v":0.35},{"$f":"IF(Reset=1,0.45,FORECAST(G42, OFFSET(Vd_1:Vd_3,MATCH(G42,I_Vd1:I_Vd3,1)-1,0,2), OFFSET(I_Vd1:I_Vd3,MATCH(G42,I_Vd1:I_Vd3,1)-1,0,2))+(G48-25)*vd_temp_coeff/1000)","v":0.36499999999999999},{"$f":"IF(Reset=1,0.45,FORECAST(H42, OFFSET(Vd_1:Vd_3,MATCH(H42,I_Vd1:I_Vd3,1)-1,0,2), OFFSET(I_Vd1:I_Vd3,MATCH(H42,I_Vd1:I_Vd3,1)-1,0,2))+(H48-25)*vd_temp_coeff/1000)","v":0.38},{"$f":"IF(Reset=1,0.45,FORECAST(I42, OFFSET(Vd_1:Vd_3,MATCH(I42,I_Vd1:I_Vd3,1)-1,0,2), OFFSET(I_Vd1:I_Vd3,MATCH(I42,I_Vd1:I_Vd3,1)-1,0,2))+(I48-25)*vd_temp_coeff/1000)","v":0.41},{"$f":"IF(Reset=1,0.45,FORECAST(J42, OFFSET(Vd_1:Vd_3,MATCH(J42,I_Vd1:I_Vd3,1)-1,0,2), OFFSET(I_Vd1:I_Vd3,MATCH(J42,I_Vd1:I_Vd3,1)-1,0,2))+(J48-25)*vd_temp_coeff/1000)","v":0.45},{"$f":"IF(Reset=1,0.45,FORECAST(K42, OFFSET(Vd_1:Vd_3,MATCH(K42,I_Vd1:I_Vd3,1)-1,0,2), OFFSET(I_Vd1:I_Vd3,MATCH(K42,I_Vd1:I_Vd3,1)-1,0,2))+(K48-25)*vd_temp_coeff/1000)","v":0.51},{"$f":"IF(Reset=1,0.45,FORECAST(L42, OFFSET(Vd_1:Vd_3,MATCH(L42,I_Vd1:I_Vd3,1)-1,0,2), OFFSET(I_Vd1:I_Vd3,MATCH(L42,I_Vd1:I_Vd3,1)-1,0,2))+(L48-25)*vd_temp_coeff/1000)","v":0.6},{"$f":"IF(Reset=1,0.45,FORECAST(M42, OFFSET(Vd_1:Vd_3,MATCH(M42,I_Vd1:I_Vd3,1)-1,0,2), OFFSET(I_Vd1:I_Vd3,MATCH(M42,I_Vd1:I_Vd3,1)-1,0,2))+(M48-25)*vd_temp_coeff/1000)","v":0.8},{"$f":"IF(Reset=1,0.45,FORECAST(N42, OFFSET(Vd_1:Vd_3,MATCH(N42,I_Vd1:I_Vd3,1)-1,0,2), OFFSET(I_Vd1:I_Vd3,MATCH(N42,I_Vd1:I_Vd3,1)-1,0,2))+(N48-25)*vd_temp_coeff/1000)","v":0.97999999999999987},{"$f":"IF(Reset=1,0.45,FORECAST(O42, OFFSET(Vd_1:Vd_3,MATCH(O42,I_Vd1:I_Vd3,1)-1,0,2), OFFSET(I_Vd1:I_Vd3,MATCH(O42,I_Vd1:I_Vd3,1)-1,0,2))+(O48-25)*vd_temp_coeff/1000)","v":1.1895238095238094}]
[null,null,null,null,150,{"$f":"E50","v":150},{"$f":"F50","v":150},150,150,150,150,150,150,150,150]
[null,null,null,null,{"$f":"IF(Reset=1,0.45,FORECAST(E42, OFFSET(Vd_1:Vd_3,MATCH(E42,I_Vd1:I_Vd3,1)-1,0,2), OFFSET(I_Vd1:I_Vd3,MATCH(E42,I_Vd1:I_Vd3,1)-1,0,2))+(E50-25)*vd_temp_coeff/1000)","v":0.19000000000000003},{"$f":"IF(Reset=1,0.45,FORECAST(F42, OFFSET(Vd_1:Vd_3,MATCH(F42,I_Vd1:I_Vd3,1)-1,0,2), OFFSET(I_Vd1:I_Vd3,MATCH(F42,I_Vd1:I_Vd3,1)-1,0,2))+(F50-25)*vd_temp_coeff/1000)","v":0.19999999999999998},{"$f":"IF(Reset=1,0.45,FORECAST(G42, OFFSET(Vd_1:Vd_3,MATCH(G42,I_Vd1:I_Vd3,1)-1,0,2), OFFSET(I_Vd1:I_Vd3,MATCH(G42,I_Vd1:I_Vd3,1)-1,0,2))+(G50-25)*vd_temp_coeff/1000)","v":0.215},{"$f":"IF(Reset=1,0.45,FORECAST(H42, OFFSET(Vd_1:Vd_3,MATCH(H42,I_Vd1:I_Vd3,1)-1,0,2), OFFSET(I_Vd1:I_Vd3,MATCH(H42,I_Vd1:I_Vd3,1)-1,0,2))+(H50-25)*vd_temp_coeff/1000)","v":0.23},{"$f":"IF(Reset=1,0.45,FORECAST(I42, OFFSET(Vd_1:Vd_3,MATCH(I42,I_Vd1:I_Vd3,1)-1,0,2), OFFSET(I_Vd1:I_Vd3,MATCH(I42,I_Vd1:I_Vd3,1)-1,0,2))+(I50-25)*vd_temp_coeff/1000)","v":0.26},{"$f":"IF(Reset=1,0.45,FORECAST(J42, OFFSET(Vd_1:Vd_3,MATCH(J42,I_Vd1:I_Vd3,1)-1,0,2), OFFSET(I_Vd1:I_Vd3,MATCH(J42,I_Vd1:I_Vd3,1)-1,0,2))+(J50-25)*vd_temp_coeff/1000)","v":0.30000000000000004},{"$f":"IF(Reset=1,0.45,FORECAST(K42, OFFSET(Vd_1:Vd_3,MATCH(K42,I_Vd1:I_Vd3,1)-1,0,2), OFFSET(I_Vd1:I_Vd3,MATCH(K42,I_Vd1:I_Vd3,1)-1,0,2))+(K50-25)*vd_temp_coeff/1000)","v":0.36},{"$f":"IF(Reset=1,0.45,FORECAST(L42, OFFSET(Vd_1:Vd_3,MATCH(L42,I_Vd1:I_Vd3,1)-1,0,2), OFFSET(I_Vd1:I_Vd3,MATCH(L42,I_Vd1:I_Vd3,1)-1,0,2))+(L50-25)*vd_temp_coeff/1000)","v":0.44999999999999996},{"$f":"IF(Reset=1,0.45,FORECAST(M42, OFFSET(Vd_1:Vd_3,MATCH(M42,I_Vd1:I_Vd3,1)-1,0,2), OFFSET(I_Vd1:I_Vd3,MATCH(M42,I_Vd1:I_Vd3,1)-1,0,2))+(M50-25)*vd_temp_coeff/1000)","v":0.65},{"$f":"IF(Reset=1,0.45,FORECAST(N42, OFFSET(Vd_1:Vd_3,MATCH(N42,I_Vd1:I_Vd3,1)-1,0,2), OFFSET(I_Vd1:I_Vd3,MATCH(N42,I_Vd1:I_Vd3,1)-1,0,2))+(N50-25)*vd_temp_coeff/1000)","v":0.82999999999999985},{"$f":"IF(Reset=1,0.45,FORECAST(O42, OFFSET(Vd_1:Vd_3,MATCH(O42,I_Vd1:I_Vd3,1)-1,0,2), OFFSET(I_Vd1:I_Vd3,MATCH(O42,I_Vd1:I_Vd3,1)-1,0,2))+(O50-25)*vd_temp_coeff/1000)","v":1.0395238095238095}]
[]
[]
[]
[]
[null,null,null,null,"Buck  Diode Specs",null,null,null,"Boost  Diode Specs"]
[null,null,null,null,null,"If","Vf",null,null,"If","Vf"]
[null,null,null,null,null,0.01,0.34,null,null,0.01,0.34]
[null,null,null,null,null,0.02,0.35,null,null,0.02,0.35]
[null,null,null,null,null,0.05,0.36499999999999999,null,null,0.05,0.36499999999999999]
[null,null,null,null,null,0.1,0.38,null,null,0.1,0.38]
[null,null,null,null,null,0.2,0.41,null,null,0.2,0.41]
[null,null,null,null,null,0.5,0.45,null,null,0.5,0.45]
[null,null,null,null,null,1,0.51,null,null,1,0.51]
[null,null,null,null,null,2,0.6,null,null,2,0.6]
[null,null,null,null,null,5,0.8,null,null,5,0.8]
[null,null,null,null,null,10,0.98,null,null,10,0.98]
[null,null,null,null,null,20.5,1.2,null,null,20.5,1.2]
[null,null,null,null,"VF, Temp. Coeff.",-1.2,null,null,"VF, Temp. Coeff.",-1]
[null,null,null,null,"RTHAVG",120,null,null,"RTHAVG",120]